program: Orca
programVersion: 4.2.1
elementType: Cl O N N N C C C C C C C C C C C C C C C C C C H H H H H H H H H H H H H H H H H H H H H H H H
charge: 0
multiplicity: 1
keywords: wb97x-d3
keywords: def2-TZVPP
keywords: def2/J RIJCOSX GRIDX6 NOFINALGRIDX
keywords: grid4 nofinalgrid
keywords: scfconv7
keywords: smallprint printgap noloewdin
keywords: NOSOSCF
formula: C18H24ClN3O
InChI: InChI=1S/C18H24ClN3O/c1-13(2)17-8-5-15(9-14-3-6-16(19)7-4-14)18(17,23)10-22-12-20-11-21-22/h3-4,6-7,11-13,15,17,23H,5,8-10H2,1-2H3
47 atoms
Cl 5.27501 4.410868 0.319334
O  -0.604968 -1.644431 1.32795
N  -1.865839 -2.893772 -0.923689
N  -3.094389 -3.083805 -1.412302
N  -2.345489 -4.961772 -0.441166
C  -1.057476 -0.81932 0.275927
C  -2.316255 0.015141 0.61646
C  -0.022702 0.309072 0.083927
C  -2.245744 1.185033 -0.382011
C  -0.761187 1.343894 -0.763036
C  -3.697496 -0.646148 0.677704
C  -1.159585 -1.633878 -1.031889
C  1.353995 -0.096379 -0.443475
C  -3.783258 -1.79476 1.679767
C  -4.749719 0.400752 1.042189
C  2.351109 1.014677 -0.270876
C  -1.434927 -4.020461 -0.354569
C  3.008738 1.191142 0.944394
C  2.616908 1.915577 -1.298004
C  3.907157 2.229376 1.13623
C  3.510903 2.963158 -1.126343
C  -3.337849 -4.328674 -1.091868
C  4.149762 3.109995 0.093678
H  -2.11654 0.418444 1.619213
H  0.121815 0.727369 1.087244
H  -2.651168 2.096449 0.055642
H  -2.854094 0.970978 -1.264802
H  -0.607709 1.146512 -1.827233
H  -0.38937 2.351899 -0.58048
H  -3.947542 -1.034697 -0.313219
H  -0.158222 -1.877895 -1.38493
H  -1.642866 -1.063965 -1.82352
H  1.295116 -0.361359 -1.501729
H  1.706638 -0.983416 0.089068
H  -1.344682 -2.123706 1.713775
H  -3.194896 -2.67042 1.400813
H  -3.466851 -1.4788 2.677195
H  -4.811382 -2.149488 1.766925
H  -5.736829 -0.057614 1.12497
H  -4.824376 1.192851 0.297004
H  -4.523914 0.868952 2.003913
H  -0.455643 -4.122786 0.083861
H  2.824035 0.50308 1.760651
H  2.124208 1.801622 -2.255854
H  4.411657 2.344806 2.085864
H  3.705515 3.650615 -1.93815
H  -4.270673 -4.804072 -1.351501
elementType: Cl O N C H
totalener: -1400.15692488 hartree
nucrepener: 2088.29734909 hartree
electener: -3488.45427396 hartree
oneelecener: -6060.22789356 hartree
twoeener: 2571.77361960 hartree
cpcmener: -0.02921579 hartree
kineticenergy: 1395.25637167 hartree
xcener: -114.440761701101 hartree
chargesum: 0.0000000
charge: -0.107922 -0.444202 0.128305 -0.349111 -0.410749 0.468513 -0.061900 -0.006138 -0.216924 -0.220088 0.017681 -0.281974 -0.093449 -0.337790 -0.310351 0.027960 0.042596 -0.229616 -0.226139 -0.155159 -0.151550 0.060522 0.093147 0.091948 0.080608 0.085459 0.087581 0.086867 0.086325 0.040906 0.159954 0.134581 0.087274 0.111839 0.245865 0.073161 0.109902 0.100515 0.092061 0.093334 0.089930 0.171989 0.141458 0.141558 0.144678 0.144302 0.162243
qa: -0.1079 -0.4442 0.1283 -0.3491 -0.4107 0.4685 -0.0619 -0.0061 -0.2169 -0.2201 0.0177 -0.2820 -0.0934 -0.3378 -0.3104 0.0280 0.0426 -0.2296 -0.2261 -0.1552 -0.1515 0.0605 0.0931 0.0919 0.0806 0.0855 0.0876 0.0869 0.0863 0.0409 0.1600 0.1346 0.0873 0.1118 0.2459 0.0732 0.1099 0.1005 0.0921 0.0933 0.0899 0.1720 0.1415 0.1416 0.1447 0.1443 0.1622
va: 1.1975 2.0069 3.3211 2.8501 3.0255 3.7723 3.8585 3.7600 3.9659 4.0018 3.7824 3.8755 3.7659 3.9325 3.9458 3.5188 4.0668 3.9939 3.9651 3.9802 3.9857 4.0251 3.8122 1.0176 1.0409 1.0064 1.0035 1.0058 1.0096 1.0403 0.9907 1.0030 1.0132 1.0222 1.0110 1.0080 1.0037 1.0054 1.0056 1.0021 1.0005 1.0098 1.0074 1.0049 1.0049 1.0053 0.9960
dispcorr: -0.027092569 hartree
energy: -1400.184017445124
dipole: -36.02603 35.58351 -0.44252 -10.38660 11.00511 0.61852 3.22066 -3.43774 -0.21709
magnitude: 0.79089 au
magnitude: 2.01029 debye
