program: Orca
programVersion: 4.2.1
elementType: Cl O N N N C C C C C C C C C C C C C C C C C C H H H H H H H H H H H H H H H H H H H H H H H H
charge: 0
multiplicity: 1
keywords: wb97x-d3
keywords: def2-TZVPP
keywords: def2/J RIJCOSX GRIDX6 NOFINALGRIDX
keywords: grid4 nofinalgrid
keywords: scfconv7
keywords: smallprint printgap noloewdin
keywords: NOSOSCF
formula: C18H24ClN3O
InChI: InChI=1S/C18H24ClN3O/c1-13(2)17-8-5-15(9-14-3-6-16(19)7-4-14)18(17,23)10-22-12-20-11-21-22/h3-4,6-7,11-13,15,17,23H,5,8-10H2,1-2H3
47 atoms
Cl 5.227542 3.704231 -0.081319
O  -1.723845 -1.189153 1.749515
N  -1.173535 -2.785405 -0.566347
N  -0.242819 -3.012548 -1.497923
N  -0.209875 -4.639755 0.043879
C  -1.789932 -0.573536 0.480811
C  -2.925968 0.477767 0.455507
C  -0.56384 0.325634 0.218489
C  -2.539664 1.403255 -0.71288
C  -1.018278 1.259296 -0.901501
C  -4.382699 0.003835 0.393598
C  -2.053829 -1.634366 -0.606267
C  0.78015 -0.356787 -0.036219
C  -4.765436 -0.941154 1.528823
C  -5.31775 1.21198 0.405895
C  1.904744 0.640333 -0.047425
C  -1.142178 -3.764455 0.33898
C  2.422382 1.121176 -1.246423
C  2.436102 1.132778 1.142341
C  3.440195 2.063931 -1.268386
C  3.454989 2.073099 1.142878
C  0.307806 -4.125035 -1.085403
C  3.948976 2.531957 -0.068437
H  -2.80952 1.038501 1.391921
H  -0.460444 0.922207 1.134209
H  -2.826684 2.433561 -0.50621
H  -3.070962 1.111447 -1.622325
H  -0.785021 0.827782 -1.878627
H  -0.500628 2.217117 -0.856805
H  -4.543696 -0.516818 -0.557997
H  -1.976396 -1.211747 -1.606632
H  -3.069446 -2.014163 -0.502555
H  0.76017 -0.883062 -0.990367
H  0.982976 -1.110162 0.733672
H  -0.826536 -1.504754 1.903788
H  -5.824247 -1.199015 1.463822
H  -4.205777 -1.875625 1.515941
H  -4.601673 -0.472855 2.502135
H  -6.36095 0.893446 0.373147
H  -5.154599 1.87239 -0.445982
H  -5.182442 1.802213 1.315586
H  -1.822948 -3.822973 1.172242
H  2.030387 0.75428 -2.187028
H  2.05578 0.773827 2.091316
H  3.829326 2.422499 -2.211494
H  3.858775 2.438535 2.077159
H  1.114343 -4.589536 -1.630503
elementType: Cl O N C H
totalener: -1400.15595604 hartree
nucrepener: 2103.31721805 hartree
electener: -3503.47317410 hartree
oneelecener: -6090.22262546 hartree
twoeener: 2586.74945136 hartree
cpcmener: -0.02939978 hartree
kineticenergy: 1395.26197935 hartree
xcener: -114.440314403062 hartree
chargesum: -0.0000000
charge: -0.108187 -0.419245 0.131617 -0.361718 -0.419401 0.450846 -0.060465 0.005412 -0.221015 -0.224043 0.025197 -0.285443 -0.120216 -0.300671 -0.310613 0.023648 0.057472 -0.208963 -0.222746 -0.160598 -0.164162 0.068237 0.103328 0.071228 0.098094 0.086334 0.090931 0.084925 0.086094 0.037204 0.137539 0.159139 0.097583 0.099847 0.229487 0.093013 0.084726 0.083931 0.092275 0.093841 0.087978 0.173267 0.138023 0.144652 0.144089 0.144105 0.163427
qa: -0.1082 -0.4192 0.1316 -0.3617 -0.4194 0.4508 -0.0605 0.0054 -0.2210 -0.2240 0.0252 -0.2854 -0.1202 -0.3007 -0.3106 0.0236 0.0575 -0.2090 -0.2227 -0.1606 -0.1642 0.0682 0.1033 0.0712 0.0981 0.0863 0.0909 0.0849 0.0861 0.0372 0.1375 0.1591 0.0976 0.0998 0.2295 0.0930 0.0847 0.0839 0.0923 0.0938 0.0880 0.1733 0.1380 0.1447 0.1441 0.1441 0.1634
va: 1.1970 2.0188 3.3283 2.8616 3.0451 3.8135 3.8401 3.7742 3.9827 3.9660 3.8470 3.8889 3.7842 3.9395 3.9315 3.5530 4.0654 3.9608 3.9893 4.0026 3.9966 4.0264 3.8026 1.0343 1.0247 1.0062 1.0029 1.0064 1.0093 1.0133 1.0020 0.9880 1.0324 1.0166 1.0141 1.0064 1.0124 1.0055 1.0054 1.0027 1.0006 1.0060 1.0060 1.0049 1.0057 1.0057 0.9949
dispcorr: -0.026860667 hartree
energy: -1400.182816711573
dipole: -44.10315 42.53830 -1.56485 -4.79928 5.46056 0.66128 2.56547 -2.67020 -0.10473
magnitude: 1.70206 au
magnitude: 4.32630 debye
