program: Orca
programVersion: 4.2.1
elementType: Cl O N N N C C C C C C C C C C C C C C C C C C H H H H H H H H H H H H H H H H H H H H H H H H
charge: 0
multiplicity: 1
keywords: wb97x-d3
keywords: def2-TZVPP
keywords: def2/J RIJCOSX GRIDX6 NOFINALGRIDX
keywords: grid4 nofinalgrid
keywords: scfconv7
keywords: smallprint printgap noloewdin
keywords: NOSOSCF
formula: C18H24ClN3O
InChI: InChI=1S/C18H24ClN3O/c1-13(2)17-8-5-15(9-14-3-6-16(19)7-4-14)18(17,23)10-22-12-20-11-21-22/h3-4,6-7,11-13,15,17,23H,5,8-10H2,1-2H3
47 atoms
Cl 5.027638 1.220209 1.678487
O  -0.813526 0.09855 1.147144
N  -0.515275 -2.001204 -0.7175
N  -0.167289 -2.416667 -1.940024
N  1.288658 -3.180429 -0.416287
C  -1.668354 0.132306 0.030023
C  -3.103948 0.644885 0.340436
C  -1.236646 1.172519 -1.025431
C  -3.665225 1.015145 -1.044532
C  -2.445823 1.268583 -1.951263
C  -4.052545 -0.22631 1.169902
C  -1.766157 -1.310349 -0.47616
C  0.084742 1.012163 -1.768861
C  -3.484459 -0.615862 2.531837
C  -5.379424 0.505041 1.369576
C  1.317557 1.070345 -0.90712
C  0.360321 -2.465445 0.17483
C  2.284487 0.07468 -0.980264
C  1.543645 2.134692 -0.034545
C  3.427757 0.109169 -0.194335
C  2.677836 2.190111 0.760029
C  0.919816 -3.108228 -1.708565
C  3.611035 1.167469 0.678232
H  -2.955087 1.574946 0.90781
H  -1.186338 2.12257 -0.4751
H  -4.31238 1.889566 -0.986123
H  -4.28205 0.202466 -1.436841
H  -2.378625 0.51691 -2.742431
H  -2.486919 2.236863 -2.450274
H  -4.273516 -1.143268 0.610178
H  -2.330789 -1.358338 -1.404474
H  -2.316362 -1.908612 0.249708
H  0.134167 1.827131 -2.49832
H  0.087139 0.093351 -2.356276
H  -0.622974 1.003419 1.417806
H  -2.594089 -1.238456 2.461831
H  -3.218233 0.270461 3.112181
H  -4.225705 -1.173688 3.10731
H  -6.063927 -0.090585 1.976484
H  -5.885966 0.716724 0.427305
H  -5.227643 1.457081 1.885393
H  0.279234 -2.283433 1.233496
H  2.15212 -0.748997 -1.669583
H  0.828464 2.945868 0.033973
H  4.160439 -0.683578 -0.264221
H  2.830936 3.022637 1.433519
H  1.465189 -3.586711 -2.507289
elementType: Cl O N C H
totalener: -1400.15363125 hartree
nucrepener: 2186.41900744 hartree
electener: -3586.57263870 hartree
oneelecener: -6257.05001302 hartree
twoeener: 2670.47737432 hartree
cpcmener: -0.02911723 hartree
kineticenergy: 1395.25991286 hartree
xcener: -114.443339123419 hartree
chargesum: 0.0000000
charge: -0.110096 -0.424080 0.165752 -0.360105 -0.404770 0.517082 -0.081606 -0.024376 -0.212863 -0.198769 0.025421 -0.318325 -0.157826 -0.304849 -0.310500 0.101403 0.068293 -0.243194 -0.294851 -0.153819 -0.135580 0.036339 0.087261 0.078476 0.092799 0.084109 0.086384 0.083945 0.087585 0.037212 0.141474 0.162751 0.109295 0.094852 0.212076 0.083833 0.084105 0.091879 0.092141 0.093782 0.087899 0.155465 0.177687 0.151140 0.137496 0.143887 0.163784
qa: -0.1101 -0.4241 0.1658 -0.3601 -0.4048 0.5171 -0.0816 -0.0244 -0.2129 -0.1988 0.0254 -0.3183 -0.1578 -0.3048 -0.3105 0.1014 0.0683 -0.2432 -0.2949 -0.1538 -0.1356 0.0363 0.0873 0.0785 0.0928 0.0841 0.0864 0.0839 0.0876 0.0372 0.1415 0.1628 0.1093 0.0949 0.2121 0.0838 0.0841 0.0919 0.0921 0.0938 0.0879 0.1555 0.1777 0.1511 0.1375 0.1439 0.1638
va: 1.1953 1.9772 3.3189 2.8493 3.0115 3.6463 3.9514 3.8557 3.9498 3.9560 3.8335 3.9282 3.8155 3.9503 3.9327 3.4788 4.0688 3.9546 3.9885 4.0165 3.9678 4.0565 3.8213 1.0169 1.0146 1.0068 1.0046 1.0056 1.0133 1.0129 0.9999 0.9870 1.0021 1.0211 1.0296 1.0142 1.0035 1.0067 1.0056 1.0022 1.0005 1.0181 0.9847 0.9999 1.0122 1.0048 0.9964
dispcorr: -0.029221172 hartree
energy: -1400.182852426653
dipole: -46.80697 44.12885 -2.67812 3.54576 -1.89307 1.65269 -2.08952 1.92564 -0.16388
magnitude: 3.15128 au
magnitude: 8.00992 debye
