program: Orca
programVersion: 4.2.1
elementType: Cl O N N N C C C C C C C C C C C C C C C C C C H H H H H H H H H H H H H H H H H H H H H H H H
charge: 0
multiplicity: 1
keywords: wb97x-d3
keywords: def2-TZVPP
keywords: def2/J RIJCOSX GRIDX6 NOFINALGRIDX
keywords: grid4 nofinalgrid
keywords: scfconv7
keywords: smallprint printgap noloewdin
keywords: NOSOSCF
formula: C18H24ClN3O
InChI: InChI=1S/C18H24ClN3O/c1-13(2)17-8-5-15(9-14-3-6-16(19)7-4-14)18(17,23)10-22-12-20-11-21-22/h3-4,6-7,11-13,15,17,23H,5,8-10H2,1-2H3
47 atoms
Cl 5.056797 1.178873 1.62916
O  -0.844656 0.130496 1.170248
N  -0.499599 -1.974383 -0.687775
N  -0.153199 -2.413088 -1.903147
N  1.326013 -3.117186 -0.372664
C  -1.685858 0.146806 0.042248
C  -3.129635 0.647172 0.33535
C  -1.252062 1.183369 -1.017223
C  -3.681495 1.005432 -1.056044
C  -2.456474 1.27034 -1.951387
C  -4.077797 -0.230576 1.159105
C  -1.762173 -1.298996 -0.454783
C  0.069794 1.019036 -1.758997
C  -3.524974 -0.602438 2.531965
C  -5.417559 0.483005 1.334445
C  1.308582 1.065077 -0.904801
C  0.390352 -2.402056 0.207442
C  2.298842 0.099461 -1.042184
C  1.523147 2.089184 0.017409
C  3.453347 0.12303 -0.272388
C  2.66801 2.133163 0.796918
C  0.94664 -3.08068 -1.662477
C  3.624553 1.13986 0.649814
H  -2.995572 1.581585 0.899206
H  -1.205881 2.137097 -0.473009
H  -4.339798 1.872071 -1.006905
H  -4.283788 0.183517 -1.451369
H  -2.377353 0.520685 -2.743313
H  -2.501639 2.239351 -2.448807
H  -4.276888 -1.154736 0.603463
H  -2.320419 -1.359306 -1.386414
H  -2.30693 -1.900379 0.273035
H  0.123656 1.836133 -2.486669
H  0.065153 0.102225 -2.350221
H  -0.692916 1.038592 1.453408
H  -2.623364 -1.209783 2.479991
H  -3.285802 0.291421 3.112729
H  -4.266723 -1.170252 3.097022
H  -5.286693 1.441356 1.843779
H  -6.100652 -0.117942 1.93736
H  -5.913769 0.678706 0.383522
H  0.314407 -2.196817 1.261757
H  2.176947 -0.693662 -1.76857
H  0.790263 2.877765 0.139212
H  4.203299 -0.646702 -0.394424
H  2.809971 2.934659 1.509089
H  1.49336 -3.569317 -2.453905
elementType: Cl O N C H
totalener: -1400.15379965 hartree
nucrepener: 2187.47327913 hartree
electener: -3587.62707879 hartree
oneelecener: -6259.18876816 hartree
twoeener: 2671.56168938 hartree
cpcmener: -0.02976590 hartree
kineticenergy: 1395.26269331 hartree
xcener: -114.443898750262 hartree
chargesum: 0.0000000
charge: -0.110548 -0.422555 0.168440 -0.361280 -0.405095 0.517636 -0.081416 -0.022552 -0.211623 -0.201043 0.027585 -0.315472 -0.159530 -0.305850 -0.310264 0.115867 0.067093 -0.241918 -0.305071 -0.152242 -0.134319 0.035206 0.085581 0.078533 0.093423 0.084102 0.086065 0.084657 0.087817 0.037492 0.141801 0.160976 0.108176 0.092511 0.210866 0.083828 0.083884 0.092012 0.087980 0.092129 0.093602 0.155337 0.168887 0.152979 0.138699 0.143375 0.164239
qa: -0.1105 -0.4226 0.1684 -0.3613 -0.4051 0.5176 -0.0814 -0.0226 -0.2116 -0.2010 0.0276 -0.3155 -0.1595 -0.3059 -0.3103 0.1159 0.0671 -0.2419 -0.3051 -0.1522 -0.1343 0.0352 0.0856 0.0785 0.0934 0.0841 0.0861 0.0847 0.0878 0.0375 0.1418 0.1610 0.1082 0.0925 0.2109 0.0838 0.0839 0.0920 0.0880 0.0921 0.0936 0.1553 0.1689 0.1530 0.1387 0.1434 0.1642
va: 1.1948 1.9775 3.3194 2.8496 3.0097 3.6502 3.9506 3.8561 3.9483 3.9563 3.8305 3.9305 3.8248 3.9500 3.9320 3.4715 4.0679 3.9583 3.9965 4.0090 3.9699 4.0564 3.8228 1.0170 1.0137 1.0068 1.0046 1.0051 1.0132 1.0129 0.9994 0.9872 1.0012 1.0204 1.0292 1.0149 1.0034 1.0065 1.0005 1.0056 1.0023 1.0192 0.9901 0.9996 1.0111 1.0052 0.9961
dispcorr: -0.029270037 hartree
energy: -1400.183069689935
dipole: -47.17186 44.44632 -2.72554 3.61023 -1.95385 1.65638 -2.05722 1.89499 -0.16223
magnitude: 3.19351 au
magnitude: 8.11725 debye
