program: Gaussian 09
title: 000030407
version: EM64L-G09RevD.01
frameworkgroup: C1[X(C16H14ClNO2)]
method: RPBEPBE
basis: SDD
operation: Freq
keyword: #p
keyword: freq=noraman
keyword: PBEPBE/SDD
title: #p freq=noraman PBEPBE/SDD
converged: YES YES NO NO
title: Mulliken charges:
elementType: Cl O O N C C C C C C C C C C C C C C C C H H H H H H H H H H H H H H
charge: -0.074094 -0.241317 -0.245508 -0.263809 -0.118414 -0.388397 0.131082 0.092546 0.218062 0.464718 -0.583272 -0.332449 -0.366304 -0.338494 -0.380788 -0.250177 -0.197450 -0.225915 -0.239761 -0.248451 0.280770 0.270633 0.249772 0.286745 0.275190 0.276509 0.256925 0.280706 0.249868 0.236080 0.235775 0.228871 0.229027 0.231321
chargesum: 0.00000
title: Mulliken charges with hydrogens summed into heavy atoms:
elementType: Cl O O N C C C C C C C C C C C C C C C C
charge: -0.074094 -0.241317 -0.245508 -0.263809 0.162356 0.132007 0.131082 0.092546 0.218062 0.464718 -0.021337 -0.055940 -0.109380 -0.057788 -0.130920 -0.014096 0.038325 0.002956 -0.010734 -0.017130
polarizability: 2.95231292e+02 -3.33866723e+00 1.88323768e+02 4.75822723e+00 -1.65323623e+01 1.06502485e+02
1716.lowfreq: -9.9973 -4.5126 -0.0012 0.0011 0.0012 5.6357 38.2198 39.0424 51.6208
frequency: 38.1690 39.0238 51.6104 61.0619 85.6632 104.1863 134.1947 145.6704 196.9192 230.7277 263.2262 266.9691 295.8719 319.2684 369.4427 404.8050 415.0243 423.9066 443.6296 492.1463 518.5486 524.5632 533.6115 561.7928 594.3249 613.8361 622.9090 672.4651 681.3039 694.3113 715.4065 754.2546 762.9351 780.7195 804.8453 816.8686 833.8661 845.9070 879.4355 908.1294 917.5609 967.5654 968.0998 974.3985 985.9179 990.8504 994.5498 1013.5771 1023.7985 1029.2105 1050.4800 1085.6289 1095.6099 1103.7864 1140.3067 1152.3350 1164.3027 1176.5465 1199.3863 1206.0508 1208.0841 1223.6568 1273.0764 1280.5210 1300.0901 1324.0255 1342.6315 1355.3173 1378.8770 1391.7106 1403.6790 1439.0340 1445.3078 1446.0499 1448.6093 1463.8030 1488.7230 1569.8668 1589.5463 1600.9716 1610.0456 1619.9582 2991.9188 3058.8494 3069.7447 3097.8237 3129.8973 3138.7568 3139.0187 3150.9538 3151.5858 3152.7932 3165.7708 3166.8428 3175.8337 3201.2959
redmass: 8.3549 6.4199 4.0199 5.9380 5.5808 5.2509 5.5690 4.9438 3.6861 4.8537 4.4495 6.0456 3.9862 6.4858 3.6279 2.8799 5.5395 3.4280 5.5783 4.0360 4.1032 4.2191 5.3068 5.8977 5.6001 6.1916 5.0434 6.3187 4.4839 2.0088 3.3794 2.4988 1.8519 1.6982 2.4656 5.0286 1.3131 4.8352 1.4601 1.4547 2.5463 1.3721 1.4106 2.5224 4.3577 1.4002 1.3334 2.2186 2.8129 2.2241 2.6754 2.3754 2.1151 1.8212 1.6061 1.8337 1.1568 1.0554 1.4064 1.7857 1.4028 2.6530 1.7646 1.5472 1.4267 1.3841 1.4960 1.3811 5.0100 5.5792 1.8695 1.1127 2.3947 1.8066 1.3346 2.4953 2.1894 8.3022 6.2108 8.4370 6.2859 7.1490 1.0638 1.0875 1.0657 1.0887 1.0850 1.0862 1.0892 1.0947 1.1113 1.0900 1.0950 1.1002 1.1004 1.0948
irintensity: 1.0445 3.0910 0.2507 0.6278 2.0056 0.6275 1.7755 3.7810 2.9001 4.0257 0.5385 0.6182 0.8449 7.3278 5.4806 0.8108 7.7277 5.0309 10.3040 6.6979 4.5366 7.6814 3.4340 15.4101 9.6499 1.2059 17.0671 1.2889 8.7776 41.0594 9.2801 16.3653 110.1016 41.3086 11.1500 14.4274 0.5289 10.3640 1.4230 0.5191 32.7720 4.1351 0.5968 16.3244 0.8159 0.1427 0.9836 8.3605 31.3384 10.8484 27.0723 12.7568 5.2723 26.3531 26.5701 23.2652 16.0542 0.3664 20.5866 27.3146 12.3413 9.4719 160.6486 113.3577 82.0017 74.4654 60.8322 22.1101 21.1652 30.8792 59.3086 24.9838 22.5567 65.6832 23.9595 9.7761 98.6734 62.3903 3.5859 123.9382 80.0161 54.4150 3.3419 2.8741 20.3912 5.6228 1.4893 3.5385 9.6216 18.8662 7.3118 6.4134 8.4084 26.8823 20.1954 1.3473
temp: 298.150 k
press: 1.00000 atm
elementType: 17 8 8 7 6 6 6 6 6 6 6 6 6 6 6 6 6 6 6 6 1 1 1 1 1 1 1 1 1 1 1 1 1 1
symmnumber: 1
zpe: 688667.3 jmol-1
zpe.correction: 0.262300 hartree
zpe.thermalcorrener: 0.279037 hartree
zpe.thermalcorrenthalpy: 0.279981 hartree
zpe.thermalcorrgfe: 0.216482 hartree
zpe.sumelectzpe: -1281.959537 hartree
zpe.sumelectthermal: -1281.942800 hartree
zpe.sumelectthermalent: -1281.941855 hartree
zpe.sumelectthermalfe: -1282.005355 hartree
dipole: 2.1211 1.7496 0.4407
dipole: 2.7846
quadrupole: -102.1098 -129.2198 -127.4142
quadrupole: 5.5457 1.6053 6.3998
quadrupole: 17.4715 -9.6385 -7.8330 5.5457 1.6053 6.3998
hfenergy: -1282.2218368 hartree
pointgroup: C01 [X(C16H14Cl1N1O2)]
dipole: -0.9124655 -0.5722953 0.2002811 debye
polarizability: 292.7395057|-16.4207585|191.9857426|-2.9485461|13.7448646|105.3322967 unknown
InChI: InChI=1S/C16H14ClNO2/c17-11-10-15-18(12-6-2-1-3-7-12)16(19)13-8-4-5-9-14(13)20-15/h1-9,15H,10-11H2
charge 0 multiplicity 1
34 atoms
Cl 0.814925 -4.312888 0.257192
O  -1.24043 -1.066055 -1.046516
O  0.059159 2.341757 0.954555
N  0.5459 0.220702 0.03023
C  -0.019731 -1.128151 -0.210051
C  -0.33023 -1.878919 1.106281
C  -0.335139 1.241104 0.466028
C  -1.783241 0.958801 0.222686
C  -2.189568 -0.135001 -0.585595
C  1.976422 0.393126 -0.06296
C  -0.696623 -3.343523 0.886025
C  -2.765651 1.874209 0.676603
C  -3.533584 -0.301697 -0.976977
C  2.536971 1.668408 -0.344566
C  2.841268 -0.724603 0.092107
C  -4.11726 1.704058 0.321126
C  -4.495361 0.622028 -0.516123
C  3.933086 1.81078 -0.47344
C  4.237595 -0.568028 -0.047776
C  4.794328 0.698106 -0.329324
H  0.685434 -1.70199 -0.828967
H  0.541343 -1.800502 1.780684
H  -1.177191 -1.379518 1.618282
H  -1.464375 -3.477084 0.110258
H  -0.984284 -3.848392 1.819164
H  -2.430268 2.72187 1.28295
H  -3.805458 -1.143986 -1.620035
H  1.887087 2.538384 -0.445555
H  2.451451 -1.719212 0.331943
H  -4.872641 2.412196 0.675871
H  -5.543985 0.495642 -0.806727
H  4.348218 2.800863 -0.69177
H  4.886947 -1.442031 0.072951
H  5.878085 0.817543 -0.431754
