program: Orca
programVersion: 4.2.1
elementType: Cl O N N N C C C C C C C C C C C C C C C C C C H H H H H H H H H H H H H H H H H H H H H H H H
charge: 0
multiplicity: 1
keywords: wb97x-d3
keywords: def2-TZVPP
keywords: def2/J RIJCOSX GRIDX6 NOFINALGRIDX
keywords: grid4 nofinalgrid
keywords: scfconv7
keywords: smallprint printgap noloewdin
keywords: NOSOSCF
formula: C18H24ClN3O
InChI: InChI=1S/C18H24ClN3O/c1-13(2)17-8-5-15(9-14-3-6-16(19)7-4-14)18(17,23)10-22-12-20-11-21-22/h3-4,6-7,11-13,15,17,23H,5,8-10H2,1-2H3
47 atoms
Cl 5.020141 1.241536 1.699539
O  -0.854423 0.09687 1.152122
N  -0.555282 -2.037766 -0.754554
N  -0.073852 -2.378069 -1.954418
N  1.162791 -3.306778 -0.330639
C  -1.66351 0.121262 -0.004196
C  -3.082954 0.636677 0.345222
C  -1.224106 1.205782 -1.011506
C  -3.651599 1.072948 -1.019165
C  -2.438903 1.363251 -1.922176
C  -4.040949 -0.258815 1.139926
C  -1.791034 -1.294792 -0.599248
C  0.091518 1.048662 -1.771329
C  -3.465106 -0.746976 2.466052
C  -5.343345 0.495071 1.403148
C  1.324418 1.093246 -0.904807
C  0.190484 -2.60088 0.197842
C  2.249277 0.053503 -0.909586
C  1.580544 2.189574 -0.07844
C  3.385965 0.086299 -0.113072
C  2.711188 2.244309 0.719817
C  0.953674 -3.129124 -1.647189
C  3.605993 1.184618 0.69867
H  -2.91273 1.536578 0.950458
H  -1.149059 2.122521 -0.413782
H  -4.293815 1.946391 -0.913881
H  -4.273862 0.281064 -1.443766
H  -2.388637 0.659229 -2.757027
H  -2.471207 2.360118 -2.362213
H  -4.295708 -1.134908 0.53175
H  -2.265206 -1.273573 -1.578496
H  -2.431552 -1.898508 0.041918
H  0.143911 1.874499 -2.4879
H  0.088097 0.135737 -2.36887
H  0.07224 0.136541 0.890367
H  -2.594722 -1.389979 2.343181
H  -3.167784 0.091517 3.099877
H  -4.214807 -1.321293 3.013696
H  -5.158516 1.406874 1.976671
H  -6.03665 -0.12004 1.979259
H  -5.853772 0.779964 0.48281
H  -0.019323 -2.501232 1.250416
H  2.095661 -0.798073 -1.558882
H  0.891724 3.024998 -0.055534
H  4.087303 -0.736528 -0.134041
H  2.890297 3.104983 1.349506
H  1.575361 -3.571753 -2.409532
elementType: Cl O N C H
totalener: -1400.15454750 hartree
nucrepener: 2184.14583454 hartree
electener: -3584.30038204 hartree
oneelecener: -6252.20129146 hartree
twoeener: 2667.90090942 hartree
cpcmener: -0.02618361 hartree
kineticenergy: 1395.25635035 hartree
xcener: -114.443213237549 hartree
chargesum: 0.0000000
charge: -0.103768 -0.436279 0.154565 -0.358946 -0.397846 0.470837 -0.076264 0.004435 -0.209152 -0.212871 0.021825 -0.327080 -0.158284 -0.298569 -0.308361 0.009011 0.042376 -0.246256 -0.234151 -0.138132 -0.133996 0.041032 0.091268 0.072209 0.100648 0.086577 0.087970 0.084053 0.087160 0.036353 0.140902 0.166995 0.112311 0.102223 0.241114 0.084197 0.083445 0.093035 0.088148 0.092336 0.094088 0.171074 0.187919 0.139996 0.139760 0.145688 0.166405
qa: -0.1038 -0.4363 0.1546 -0.3589 -0.3978 0.4708 -0.0763 0.0044 -0.2092 -0.2129 0.0218 -0.3271 -0.1583 -0.2986 -0.3084 0.0090 0.0424 -0.2463 -0.2342 -0.1381 -0.1340 0.0410 0.0913 0.0722 0.1006 0.0866 0.0880 0.0841 0.0872 0.0364 0.1409 0.1670 0.1123 0.1022 0.2411 0.0842 0.0834 0.0930 0.0881 0.0923 0.0941 0.1711 0.1879 0.1400 0.1398 0.1457 0.1664
va: 1.2016 2.0081 3.3086 2.8426 3.0231 3.7172 3.8592 3.8257 3.9484 3.9784 3.8534 3.9056 3.7979 3.9403 3.9299 3.5479 4.0693 3.9388 4.0099 4.0133 3.9655 4.0467 3.8309 1.0330 1.0159 1.0057 1.0039 1.0053 1.0135 1.0142 1.0036 0.9848 1.0037 1.0212 1.0209 1.0115 1.0057 1.0067 1.0006 1.0057 1.0021 1.0085 0.9876 1.0056 1.0113 1.0045 0.9957
dispcorr: -0.029241930 hartree
energy: -1400.183789426611
dipole: -46.00279 43.94968 -2.05312 2.75576 -1.66810 1.08766 -2.77989 2.04828 -0.73161
magnitude: 2.43589 au
magnitude: 6.19153 debye
