program: Orca
programVersion: 4.2.1
elementType: Cl O N N N C C C C C C C C C C C C C C C C C C H H H H H H H H H H H H H H H H H H H H H H H H
charge: 0
multiplicity: 1
keywords: wb97x-d3
keywords: def2-TZVPP
keywords: def2/J RIJCOSX GRIDX6 NOFINALGRIDX
keywords: grid4 nofinalgrid
keywords: scfconv7
keywords: smallprint printgap noloewdin
keywords: NOSOSCF
formula: C18H24ClN3O
InChI: InChI=1S/C18H24ClN3O/c1-13(2)17-8-5-15(9-14-3-6-16(19)7-4-14)18(17,23)10-22-12-20-11-21-22/h3-4,6-7,11-13,15,17,23H,5,8-10H2,1-2H3
47 atoms
Cl 5.295016 3.570587 0.16286
O  -1.626665 -1.380823 1.677843
N  -1.192062 -2.659993 -0.810292
N  -0.513402 -2.760581 -1.956479
N  -0.001609 -4.464659 -0.60225
C  -1.804918 -0.604492 0.517904
C  -2.933222 0.457973 0.625632
C  -0.58598 0.303717 0.238535
C  -2.603783 1.455146 -0.499266
C  -1.097259 1.307544 -0.791424
C  -4.394865 -0.005318 0.626376
C  -2.151015 -1.595061 -0.598261
C  0.740921 -0.366716 -0.113982
C  -4.718587 -0.986951 1.74987
C  -5.324413 1.203354 0.729389
C  1.887032 0.605198 -0.05334
C  -0.882487 -3.687787 -0.015468
C  2.496141 0.911522 1.161588
C  2.355639 1.243036 -1.19855
C  3.540512 1.820005 1.239306
C  3.398003 2.157354 -1.142893
C  0.190969 -3.850869 -1.78481
C  3.983928 2.43784 0.080398
H  -2.760416 0.963799 1.587214
H  -0.42985 0.849552 1.180615
H  -2.860949 2.473699 -0.209662
H  -3.193913 1.232775 -1.392216
H  -0.93098 0.931035 -1.804341
H  -0.567955 2.258258 -0.726652
H  -4.609933 -0.493857 -0.331719
H  -2.259401 -1.084742 -1.55302
H  -3.111429 -2.062337 -0.379802
H  0.692737 -0.79758 -1.114572
H  0.931506 -1.187712 0.582291
H  -1.447727 -0.793666 2.420812
H  -5.778729 -1.24776 1.732104
H  -4.156465 -1.916925 1.682375
H  -4.508676 -0.548502 2.728913
H  -5.2192 1.884177 -0.115981
H  -5.13028 1.77479 1.641047
H  -6.369126 0.88788 0.758255
H  -1.316597 -3.83603 0.959243
H  2.159729 0.426243 2.070475
H  1.907874 1.022943 -2.160312
H  4.004316 2.037327 2.192217
H  3.748039 2.639282 -2.045995
H  0.863955 -4.218918 -2.54379
elementType: Cl O N C H
totalener: -1400.16903903 hartree
nucrepener: 2103.37977376 hartree
electener: -3503.54881279 hartree
oneelecener: -6090.67395313 hartree
twoeener: 2587.12514034 hartree
cpcmener: -0.02627421 hartree
kineticenergy: 1395.22804747 hartree
xcener: -114.433594177316 hartree
chargesum: 0.0000000
charge: -0.106223 -0.415159 0.134237 -0.364059 -0.411532 0.520096 -0.086120 -0.028305 -0.225161 -0.211283 0.022854 -0.270265 -0.106214 -0.303537 -0.307828 0.030338 0.073332 -0.225424 -0.223993 -0.162465 -0.153729 0.062634 0.099429 0.079026 0.087050 0.084856 0.087667 0.085277 0.086433 0.038889 0.135736 0.152363 0.091917 0.104745 0.206327 0.092572 0.084372 0.083783 0.092413 0.087894 0.091959 0.162621 0.139541 0.136658 0.142116 0.142270 0.161893
qa: -0.1062 -0.4152 0.1342 -0.3641 -0.4115 0.5201 -0.0861 -0.0283 -0.2252 -0.2113 0.0229 -0.2703 -0.1062 -0.3035 -0.3078 0.0303 0.0733 -0.2254 -0.2240 -0.1625 -0.1537 0.0626 0.0994 0.0790 0.0871 0.0849 0.0877 0.0853 0.0864 0.0389 0.1357 0.1524 0.0919 0.1047 0.2063 0.0926 0.0844 0.0838 0.0924 0.0879 0.0920 0.1626 0.1395 0.1367 0.1421 0.1423 0.1619
va: 1.1991 1.9878 3.3423 2.8609 3.0440 3.6756 3.9133 3.8594 3.9756 3.9659 3.8345 3.9326 3.7444 3.9463 3.9382 3.5413 4.0562 3.9978 3.9741 3.9987 3.9972 4.0324 3.8175 1.0173 1.0217 1.0071 1.0035 1.0080 1.0096 1.0119 1.0005 0.9910 1.0324 1.0291 1.0271 1.0065 1.0179 1.0031 1.0032 1.0007 1.0057 1.0130 1.0066 1.0068 1.0062 1.0060 0.9955
dispcorr: -0.026791846 hartree
energy: -1400.195830876187
dipole: -45.12914 43.04638 -2.08276 -3.80671 4.99998 1.19327 4.63348 -3.87422 0.75927
magnitude: 2.51759 au
magnitude: 6.39922 debye
