program: Orca
programVersion: 4.2.1
elementType: Cl O N N N C C C C C C C C C C C C C C C C C C H H H H H H H H H H H H H H H H H H H H H H H H
charge: 0
multiplicity: 1
keywords: wb97x-d3
keywords: def2-TZVPP
keywords: def2/J RIJCOSX GRIDX6 NOFINALGRIDX
keywords: grid4 nofinalgrid
keywords: scfconv7
keywords: smallprint printgap noloewdin
keywords: NOSOSCF
formula: C18H24ClN3O
InChI: InChI=1S/C18H24ClN3O/c1-13(2)17-8-5-15(9-14-3-6-16(19)7-4-14)18(17,23)10-22-12-20-11-21-22/h3-4,6-7,11-13,15,17,23H,5,8-10H2,1-2H3
47 atoms
Cl 4.991974 1.349216 1.762566
O  -0.774026 -0.007393 1.107166
N  -0.561318 -2.067341 -0.772347
N  -0.191165 -2.435198 -2.003195
N  1.17266 -3.343416 -0.480594
C  -1.642841 0.089456 0.008715
C  -3.058888 0.635566 0.355119
C  -1.197595 1.149778 -1.023088
C  -3.628603 1.058401 -1.011992
C  -2.41524 1.30436 -1.92988
C  -4.022198 -0.227247 1.177929
C  -1.789528 -1.333605 -0.541694
C  0.120577 0.984485 -1.774007
C  -3.448282 -0.671243 2.520853
C  -5.323474 0.538447 1.414355
C  1.34372 1.074176 -0.900979
C  0.256907 -2.622882 0.124488
C  2.257506 0.030344 -0.825771
C  1.602976 2.221343 -0.151622
C  3.380715 0.102851 -0.014438
C  2.717712 2.315679 0.666354
C  0.852908 -3.195042 -1.780373
C  3.597823 1.24654 0.733804
H  -2.873673 1.545844 0.943396
H  -1.119525 2.081436 -0.444779
H  -4.25049 1.948599 -0.921589
H  -4.272409 0.273169 -1.416569
H  -2.381059 0.578439 -2.746942
H  -2.437138 2.289826 -2.39667
H  -4.279248 -1.122991 0.599546
H  -2.330554 -1.333701 -1.485704
H  -2.380333 -1.928178 0.154884
H  0.164311 1.790624 -2.513806
H  0.131342 0.055486 -2.345293
H  -0.564722 0.878827 1.42136
H  -2.569627 -1.306525 2.423357
H  -3.162972 0.188981 3.131851
H  -4.195403 -1.236125 3.08262
H  -5.136755 1.475022 1.946321
H  -6.01561 -0.049354 2.020155
H  -5.838702 0.782966 0.484932
H  0.149328 -2.486869 1.187763
H  2.103067 -0.86153 -1.417816
H  0.929864 3.069306 -0.20359
H  4.073412 -0.726733 0.029258
H  2.89731 3.215291 1.239636
H  1.400998 -3.659603 -2.58514
elementType: Cl O N C H
totalener: -1400.16428746 hartree
nucrepener: 2179.94545685 hartree
electener: -3580.10974431 hartree
oneelecener: -6244.06449971 hartree
twoeener: 2663.95475540 hartree
cpcmener: -0.02484641 hartree
kineticenergy: 1395.23476552 hartree
xcener: -114.437611134749 hartree
chargesum: -0.0000000
charge: -0.108124 -0.408235 0.155854 -0.354302 -0.401670 0.507042 -0.087888 -0.020316 -0.213072 -0.197723 0.019772 -0.321590 -0.169321 -0.300575 -0.307441 0.071394 0.069987 -0.216035 -0.258541 -0.163214 -0.143552 0.043759 0.095711 0.077778 0.088545 0.084585 0.087114 0.084142 0.085372 0.036066 0.142054 0.160414 0.110698 0.100172 0.206124 0.085553 0.082886 0.091674 0.087551 0.091617 0.093460 0.155428 0.179752 0.138979 0.135336 0.142065 0.160717
qa: -0.1081 -0.4082 0.1559 -0.3543 -0.4017 0.5070 -0.0879 -0.0203 -0.2131 -0.1977 0.0198 -0.3216 -0.1693 -0.3006 -0.3074 0.0714 0.0700 -0.2160 -0.2585 -0.1632 -0.1436 0.0438 0.0957 0.0778 0.0885 0.0846 0.0871 0.0841 0.0854 0.0361 0.1421 0.1604 0.1107 0.1002 0.2061 0.0856 0.0829 0.0917 0.0876 0.0916 0.0935 0.1554 0.1798 0.1390 0.1353 0.1421 0.1607
va: 1.1971 1.9949 3.3167 2.8457 3.0172 3.6642 3.9408 3.8387 3.9466 3.9588 3.8425 3.9278 3.8055 3.9503 3.9332 3.5075 4.0689 3.9485 3.9783 4.0374 3.9737 4.0479 3.8195 1.0168 1.0150 1.0069 1.0045 1.0061 1.0139 1.0132 1.0011 0.9881 1.0039 1.0235 1.0349 1.0138 1.0038 1.0065 1.0008 1.0061 1.0023 1.0162 0.9786 1.0039 1.0132 1.0053 0.9975
dispcorr: -0.028993269 hartree
energy: -1400.193280733947
dipole: -46.28508 43.72715 -2.55793 3.28350 -1.71115 1.57235 -2.14865 2.03239 -0.11626
magnitude: 3.00480 au
magnitude: 7.63759 debye
