program: Orca
programVersion: 4.2.1
elementType: Cl O N N N C C C C C C C C C C C C C C C C C C H H H H H H H H H H H H H H H H H H H H H H H H
charge: 0
multiplicity: 1
keywords: wb97x-d3
keywords: def2-TZVPP
keywords: def2/J RIJCOSX GRIDX6 NOFINALGRIDX
keywords: grid4 nofinalgrid
keywords: scfconv7
keywords: smallprint printgap noloewdin
keywords: NOSOSCF
formula: C18H24ClN3O
InChI: InChI=1S/C18H24ClN3O/c1-13(2)17-8-5-15(9-14-3-6-16(19)7-4-14)18(17,23)10-22-12-20-11-21-22/h3-4,6-7,11-13,15,17,23H,5,8-10H2,1-2H3
47 atoms
Cl 5.170494 3.654002 0.163755
O  -1.656716 -1.407748 1.696608
N  -1.197896 -2.652312 -0.842608
N  -0.580995 -2.710468 -2.028246
N  0.100702 -4.391794 -0.714017
C  -1.815227 -0.63426 0.531384
C  -2.920756 0.453025 0.625159
C  -0.580688 0.246057 0.242195
C  -2.569944 1.424383 -0.517731
C  -1.070805 1.226211 -0.818951
C  -4.391494 0.022988 0.640415
C  -2.180846 -1.629573 -0.572222
C  0.752838 -0.432411 -0.067064
C  -4.732623 -0.927498 1.785808
C  -5.293579 1.254252 0.721389
C  1.881803 0.559485 -0.01685
C  -0.782865 -3.668217 -0.072409
C  2.457172 0.926322 1.19617
C  2.355233 1.170561 -1.173105
C  3.466187 1.873088 1.262593
C  3.362516 2.122067 -1.128322
C  0.18974 -3.764013 -1.903224
C  3.912084 2.469872 0.094174
H  -2.736807 0.975008 1.577184
H  -0.43312 0.823316 1.168858
H  -2.794389 2.454023 -0.241001
H  -3.176897 1.210296 -1.401592
H  -0.922235 0.803086 -1.816108
H  -0.511468 2.160848 -0.795766
H  -4.618651 -0.480182 -0.307684
H  -2.350927 -1.117607 -1.517229
H  -3.116499 -2.123073 -0.303188
H  0.723477 -0.894992 -1.053768
H  0.934941 -1.233312 0.65435
H  -1.434206 -0.824581 2.427816
H  -5.796549 -1.168603 1.774271
H  -4.181285 -1.864548 1.746241
H  -4.516276 -0.465031 2.751698
H  -5.162158 1.925017 -0.127358
H  -5.093046 1.825927 1.630934
H  -6.344412 0.962955 0.745086
H  -1.142571 -3.835744 0.929314
H  2.118059 0.456191 2.11218
H  1.932723 0.896871 -2.132408
H  3.906789 2.141324 2.212913
H  3.719479 2.585938 -2.03749
H  0.835955 -4.093339 -2.701712
totalener: -1400.13994175 hartree
nucrepener: 2108.25509542 hartree
electener: -3508.39503717 hartree
oneelecener: -6100.40268510 hartree
twoeener: 2592.00764793 hartree
kineticenergy: 1395.25125961 hartree
xcener: -114.434870273747 hartree
chargesum: -0.0000000
charge: -0.086499 -0.363060 0.123202 -0.332648 -0.327191 0.507538 -0.078117 -0.050009 -0.242889 -0.204462 0.000774 -0.287963 -0.128389 -0.274834 -0.281267 0.074525 0.048196 -0.207952 -0.213269 -0.139996 -0.122942 0.062267 0.089652 0.065642 0.072814 0.084836 0.086675 0.085550 0.094389 0.037153 0.135071 0.135259 0.097124 0.109873 0.170705 0.088914 0.087855 0.073982 0.088865 0.083663 0.088203 0.147341 0.112035 0.116937 0.119483 0.120732 0.132230
qa: -0.0865 -0.3631 0.1232 -0.3326 -0.3272 0.5075 -0.0781 -0.0500 -0.2429 -0.2045 0.0008 -0.2880 -0.1284 -0.2748 -0.2813 0.0745 0.0482 -0.2080 -0.2133 -0.1400 -0.1229 0.0623 0.0897 0.0656 0.0728 0.0848 0.0867 0.0856 0.0944 0.0372 0.1351 0.1353 0.0971 0.1099 0.1707 0.0889 0.0879 0.0740 0.0889 0.0837 0.0882 0.1473 0.1120 0.1169 0.1195 0.1207 0.1322
va: 1.2199 2.0296 3.3231 2.8332 3.0692 3.6441 3.8802 3.8525 3.9847 3.9619 3.8705 3.9698 3.7640 3.9485 3.9470 3.5725 4.0614 4.0293 4.0062 4.0350 4.0150 4.0373 3.9216 1.0197 1.0247 1.0099 1.0052 1.0137 1.0110 1.0090 1.0003 0.9949 1.0380 1.0314 1.0589 1.0076 1.0204 1.0064 1.0060 1.0024 1.0086 1.0163 1.0125 1.0116 1.0131 1.0122 1.0018
dispcorr: -0.026955536 hartree
energy: -1400.166897288656
dipole: -44.47259 42.96286 -1.50973 -4.17337 5.04386 0.87049 4.87844 -4.28832 0.59011
magnitude: 1.83991 au
magnitude: 4.67667 debye
