program: Orca
programVersion: 4.2.1
elementType: Cl O N N N C C C C C C C C C C C C C C C C C C H H H H H H H H H H H H H H H H H H H H H H H H
charge: 0
multiplicity: 1
keywords: wb97x-d3
keywords: def2-TZVPP
keywords: def2/J RIJCOSX GRIDX6 NOFINALGRIDX
keywords: grid4 nofinalgrid
keywords: scfconv7
keywords: smallprint printgap noloewdin
keywords: NOSOSCF
formula: C18H24ClN3O
InChI: InChI=1S/C18H24ClN3O/c1-13(2)17-8-5-15(9-14-3-6-16(19)7-4-14)18(17,23)10-22-12-20-11-21-22/h3-4,6-7,11-13,15,17,23H,5,8-10H2,1-2H3
47 atoms
Cl 4.959614 1.2912 1.81594
O  -0.845721 0.07249 1.167575
N  -0.574601 -2.059156 -0.760683
N  -0.180212 -2.401461 -1.991659
N  1.16793 -3.32839 -0.460406
C  -1.651863 0.100351 0.017957
C  -3.063766 0.648127 0.355343
C  -1.202748 1.155649 -1.017853
C  -3.631009 1.056778 -1.018418
C  -2.415743 1.298617 -1.933417
C  -4.03173 -0.20541 1.182946
C  -1.803347 -1.327479 -0.541883
C  0.119141 0.982424 -1.76561
C  -3.460859 -0.637837 2.531231
C  -5.331966 0.566042 1.410113
C  1.339808 1.05963 -0.883212
C  0.238136 -2.627892 0.141723
C  2.238757 0.001899 -0.794673
C  1.604026 2.201768 -0.125567
C  3.351432 0.061164 0.032075
C  2.712404 2.281953 0.6999
C  0.867941 -3.157463 -1.76336
C  3.581274 1.203421 0.778401
H  -2.873298 1.559174 0.937535
H  -1.126659 2.084717 -0.437587
H  -4.257189 1.944626 -0.936759
H  -4.274034 0.268344 -1.418881
H  -2.372933 0.566068 -2.743721
H  -2.437495 2.278685 -2.411285
H  -4.291869 -1.104663 0.61014
H  -2.334262 -1.335634 -1.492183
H  -2.398386 -1.91363 0.158583
H  0.174764 1.787058 -2.506545
H  0.123371 0.052495 -2.336039
H  0.07088 0.237286 0.923478
H  -3.17099 0.229126 3.126961
H  -4.209438 -1.193825 3.097625
H  -2.579869 -1.269536 2.441131
H  -6.02707 -0.01736 2.015102
H  -5.841519 0.811932 0.478531
H  -5.141073 1.500861 1.942481
H  0.11114 -2.51093 1.206112
H  2.077029 -0.888961 -1.385682
H  0.934103 3.051866 -0.178687
H  4.027902 -0.779952 0.09274
H  2.900454 3.175477 1.279079
H  1.4307 -3.605961 -2.567342
totalener: -1400.13922299 hartree
nucrepener: 2183.73069662 hartree
electener: -3583.86991962 hartree
oneelecener: -6251.25691554 hartree
twoeener: 2667.38699593 hartree
kineticenergy: 1395.24087855 hartree
xcener: -114.438206219725 hartree
chargesum: -0.0000000
charge: -0.078874 -0.374429 0.149472 -0.317824 -0.322659 0.478862 -0.061308 -0.027017 -0.223715 -0.208173 -0.025090 -0.340935 -0.192723 -0.250013 -0.280579 0.021076 0.016539 -0.233062 -0.198146 -0.113930 -0.121286 0.033201 0.089871 0.069151 0.095328 0.085008 0.085161 0.086753 0.083082 0.031016 0.139258 0.145639 0.106020 0.115168 0.214612 0.083593 0.083501 0.078396 0.086161 0.086830 0.084826 0.154155 0.172487 0.109874 0.127097 0.121381 0.136241
qa: -0.0789 -0.3744 0.1495 -0.3178 -0.3227 0.4789 -0.0613 -0.0270 -0.2237 -0.2082 -0.0251 -0.3409 -0.1927 -0.2500 -0.2806 0.0211 0.0165 -0.2331 -0.1981 -0.1139 -0.1213 0.0332 0.0899 0.0692 0.0953 0.0850 0.0852 0.0868 0.0831 0.0310 0.1393 0.1456 0.1060 0.1152 0.2146 0.0836 0.0835 0.0784 0.0862 0.0868 0.0848 0.1542 0.1725 0.1099 0.1271 0.1214 0.1362
va: 1.2273 2.0756 3.2871 2.8182 3.0376 3.7168 3.8101 3.8151 3.9407 3.9632 3.9277 3.9273 3.7987 3.9456 3.9346 3.5876 4.0808 3.9853 4.0275 4.0270 4.0069 4.0475 3.9168 1.0347 1.0145 1.0098 1.0059 1.0095 1.0166 1.0091 1.0055 0.9913 1.0039 1.0252 1.0529 1.0084 1.0061 1.0198 1.0093 1.0045 1.0035 1.0125 0.9854 1.0139 1.0163 1.0136 1.0022
dispcorr: -0.029227326 hartree
energy: -1400.168450319219
dipole: -45.56731 44.22129 -1.34602 2.92431 -2.08510 0.83921 -2.89169 2.49636 -0.39534
magnitude: 1.63473 au
magnitude: 4.15515 debye
