program: Orca
programVersion: 4.2.1
elementType: Cl O N N N C C C C C C C C C C C C C C C C C C H H H H H H H H H H H H H H H H H H H H H H H H
charge: 0
multiplicity: 1
keywords: wb97x-d3
keywords: def2-TZVPP
keywords: def2/J RIJCOSX GRIDX6 NOFINALGRIDX
keywords: grid4 nofinalgrid
keywords: scfconv7
keywords: smallprint printgap noloewdin
keywords: NOSOSCF
formula: C18H24ClN3O
InChI: InChI=1S/C18H24ClN3O/c1-13(2)17-8-5-15(9-14-3-6-16(19)7-4-14)18(17,23)10-22-12-20-11-21-22/h3-4,6-7,11-13,15,17,23H,5,8-10H2,1-2H3
47 atoms
Cl 4.93397 1.389787 1.790089
O  -0.867268 0.107595 1.166093
N  -0.556906 -2.025069 -0.756043
N  -0.150996 -2.361086 -1.984855
N  1.203259 -3.267675 -0.446814
C  -1.672664 0.117726 0.01566
C  -3.094485 0.640575 0.351084
C  -1.241776 1.178741 -1.022003
C  -3.668342 1.034995 -1.024039
C  -2.457034 1.298788 -1.938135
C  -4.046809 -0.228608 1.180583
C  -1.798186 -1.31339 -0.542504
C  0.081944 1.02646 -1.770866
C  -3.467016 -0.649751 2.52869
C  -5.359814 0.520832 1.407917
C  1.303666 1.117854 -0.891195
C  0.259823 -2.581477 0.150515
C  2.222895 0.076573 -0.818473
C  1.55009 2.256459 -0.122512
C  3.338996 0.148114 0.002543
C  2.66141 2.348802 0.697748
C  0.907066 -3.101536 -1.751141
C  3.551413 1.286631 0.759579
H  -2.920978 1.556441 0.930928
H  -1.181399 2.110034 -0.443506
H  -4.31215 1.910374 -0.945274
H  -4.294994 0.232964 -1.423502
H  -2.399754 0.566651 -2.747954
H  -2.49684 2.277863 -2.416849
H  -4.29218 -1.132889 0.609101
H  -2.325788 -1.331442 -1.49451
H  -2.385846 -1.908487 0.156716
H  0.12534 1.833912 -2.509642
H  0.098186 0.098075 -2.343821
H  0.048764 0.270861 0.919161
H  -3.180894 0.22234 3.118881
H  -4.20892 -1.20873 3.10126
H  -2.581614 -1.275477 2.437574
H  -5.870896 0.762619 0.476078
H  -5.185323 1.45619 1.944967
H  -6.047026 -0.076522 2.008385
H  0.125546 -2.466744 1.214302
H  2.073871 -0.810853 -1.417915
H  0.864044 3.094139 -0.162519
H  4.031453 -0.680703 0.050709
H  2.835557 3.239271 1.285744
H  1.480565 -3.541375 -2.552328
totalener: -1400.13918191 hartree
nucrepener: 2184.02594271 hartree
electener: -3584.16512462 hartree
oneelecener: -6251.85023796 hartree
twoeener: 2667.68511334 hartree
kineticenergy: 1395.24109757 hartree
xcener: -114.438195727870 hartree
chargesum: -0.0000000
charge: -0.078947 -0.373351 0.150212 -0.318359 -0.321375 0.480848 -0.061144 -0.026471 -0.223383 -0.209005 -0.025918 -0.342981 -0.191858 -0.249442 -0.280421 0.018880 0.016304 -0.232645 -0.197824 -0.113505 -0.120974 0.031527 0.089663 0.069449 0.095133 0.084938 0.085199 0.086727 0.083187 0.030686 0.139499 0.146043 0.105786 0.114405 0.214326 0.083930 0.083424 0.078026 0.086857 0.084834 0.086096 0.154435 0.172819 0.109774 0.126747 0.121211 0.136637
qa: -0.0789 -0.3734 0.1502 -0.3184 -0.3214 0.4808 -0.0611 -0.0265 -0.2234 -0.2090 -0.0259 -0.3430 -0.1919 -0.2494 -0.2804 0.0189 0.0163 -0.2326 -0.1978 -0.1135 -0.1210 0.0315 0.0897 0.0694 0.0951 0.0849 0.0852 0.0867 0.0832 0.0307 0.1395 0.1460 0.1058 0.1144 0.2143 0.0839 0.0834 0.0780 0.0869 0.0848 0.0861 0.1544 0.1728 0.1098 0.1267 0.1212 0.1366
va: 1.2273 2.0769 3.2853 2.8169 3.0388 3.7148 3.8092 3.8153 3.9408 3.9634 3.9278 3.9286 3.8006 3.9463 3.9346 3.5900 4.0800 3.9852 4.0261 4.0262 4.0079 4.0487 3.9176 1.0344 1.0145 1.0098 1.0060 1.0094 1.0166 1.0092 1.0055 0.9912 1.0037 1.0250 1.0527 1.0085 1.0061 1.0194 1.0045 1.0034 1.0093 1.0121 0.9856 1.0139 1.0164 1.0137 1.0020
dispcorr: -0.029241098 hartree
energy: -1400.168423003859
dipole: -45.68040 44.31522 -1.36518 2.25875 -1.44950 0.80925 -2.83543 2.43600 -0.39943
magnitude: 1.63650 au
magnitude: 4.15966 debye
