program: Orca
programVersion: 4.2.1
elementType: Cl O N N N C C C C C C C C C C C C C C C C C C H H H H H H H H H H H H H H H H H H H H H H H H
charge: 0
multiplicity: 1
keywords: wb97x-d3
keywords: def2-TZVPP
keywords: def2/J RIJCOSX GRIDX6 NOFINALGRIDX
keywords: grid4 nofinalgrid
keywords: scfconv7
keywords: smallprint printgap noloewdin
keywords: NOSOSCF
formula: C18H24ClN3O
InChI: InChI=1S/C18H24ClN3O/c1-13(2)17-8-5-15(9-14-3-6-16(19)7-4-14)18(17,23)10-22-12-20-11-21-22/h3-4,6-7,11-13,15,17,23H,5,8-10H2,1-2H3
47 atoms
Cl 5.190224 0.796567 1.315939
O  -1.150652 0.363174 1.324062
N  -0.407552 -1.772531 -0.534122
N  0.421809 -1.787859 0.513993
N  1.346076 -2.869144 -1.208997
C  -1.801525 0.229004 0.094177
C  -3.284898 0.64471 0.279451
C  -1.339171 1.275489 -0.954575
C  -3.768179 1.007314 -1.132559
C  -2.509565 1.369625 -1.937637
C  -4.237314 -0.303774 1.019134
C  -1.742226 -1.22141 -0.41953
C  -0.017627 1.118545 -1.701901
C  -3.764135 -0.693251 2.417782
C  -5.623571 0.334375 1.117486
C  1.260287 1.038947 -0.9073
C  0.159534 -2.431247 -1.551008
C  1.449975 1.723195 0.2902
C  2.327553 0.301284 -1.409337
C  2.652096 1.652857 0.975962
C  3.537541 0.221229 -0.739611
C  1.463613 -2.444908 0.062726
C  3.691037 0.896886 0.458471
H  -3.232193 1.567564 0.872449
H  -1.30093 2.216996 -0.394038
H  -4.48487 1.827585 -1.107999
H  -4.293689 0.162645 -1.587798
H  -2.363949 0.673435 -2.76929
H  -2.569745 2.361383 -2.387457
H  -4.352207 -1.219252 0.423511
H  -2.206668 -1.303587 -1.403631
H  -2.302336 -1.870197 0.255187
H  0.057963 1.980524 -2.375974
H  -0.070879 0.254902 -2.370742
H  -0.3501 -0.182839 1.339524
H  -2.827663 -1.246149 2.418213
H  -3.609666 0.192028 3.036284
H  -4.516371 -1.313892 2.907773
H  -5.578151 1.280098 1.662978
H  -6.313068 -0.318885 1.653753
H  -6.06238 0.535805 0.140197
H  -0.322856 -2.568145 -2.507034
H  0.650367 2.313345 0.71588
H  2.214343 -0.241054 -2.339919
H  2.777383 2.182504 1.910303
H  4.347985 -0.369042 -1.144397
H  2.336068 -2.615846 0.672487
totalener: -1400.13792122 hartree
nucrepener: 2207.18262152 hartree
electener: -3607.32054274 hartree
oneelecener: -6298.60608010 hartree
twoeener: 2691.28553736 hartree
kineticenergy: 1395.25309206 hartree
xcener: -114.444921384320 hartree
chargesum: 0.0000000
charge: -0.088321 -0.378591 0.164065 -0.330625 -0.326346 0.489581 -0.052502 0.025558 -0.211083 -0.234468 -0.025273 -0.333380 -0.193516 -0.247410 -0.281627 0.108995 0.006019 -0.228591 -0.200612 -0.114711 -0.153726 0.082708 0.094811 0.072397 0.085590 0.085496 0.079122 0.079043 0.087827 0.026951 0.116808 0.145764 0.104525 0.068953 0.212312 0.079093 0.083984 0.081125 0.086272 0.085535 0.085500 0.145045 0.117028 0.118567 0.120914 0.125232 0.135965
qa: -0.0883 -0.3786 0.1641 -0.3306 -0.3263 0.4896 -0.0525 0.0256 -0.2111 -0.2345 -0.0253 -0.3334 -0.1935 -0.2474 -0.2816 0.1090 0.0060 -0.2286 -0.2006 -0.1147 -0.1537 0.0827 0.0948 0.0724 0.0856 0.0855 0.0791 0.0790 0.0878 0.0270 0.1168 0.1458 0.1045 0.0690 0.2123 0.0791 0.0840 0.0811 0.0863 0.0855 0.0855 0.1450 0.1170 0.1186 0.1209 0.1252 0.1360
va: 1.2182 2.0783 3.2878 2.8564 3.0317 3.7579 3.8089 3.7699 3.9327 3.9638 3.9278 4.0046 3.8760 3.9444 3.9310 3.5110 4.0713 3.9962 3.9498 4.0276 4.0076 4.0210 3.8871 1.0322 1.0115 1.0114 1.0061 1.0053 1.0173 1.0074 0.9886 0.9884 0.9942 1.0015 1.0787 1.0271 1.0084 1.0053 1.0037 1.0093 1.0044 1.0009 1.0303 1.0108 1.0117 1.0122 1.0017
dispcorr: -0.030222432 hartree
energy: -1400.168143655663
dipole: -48.68488 47.07538 -1.60951 2.61698 -2.48658 0.13040 -3.96836 2.97824 -0.99013
magnitude: 1.89417 au
magnitude: 4.81459 debye
