program: Orca
programVersion: 4.2.1
elementType: Cl O N N N C C C C C C C C C C C C C C C C C C H H H H H H H H H H H H H H H H H H H H H H H H
charge: 0
multiplicity: 1
keywords: wb97x-d3
keywords: def2-TZVPP
keywords: def2/J RIJCOSX GRIDX6 NOFINALGRIDX
keywords: grid4 nofinalgrid
keywords: scfconv7
keywords: smallprint printgap noloewdin
keywords: NOSOSCF
formula: C18H24ClN3O
InChI: InChI=1S/C18H24ClN3O/c1-13(2)17-8-5-15(9-14-3-6-16(19)7-4-14)18(17,23)10-22-12-20-11-21-22/h3-4,6-7,11-13,15,17,23H,5,8-10H2,1-2H3
47 atoms
Cl 4.961931 1.278354 1.833021
O  -0.836579 0.015895 1.146792
N  -0.582888 -2.073587 -0.820199
N  -0.168971 -2.385735 -2.052718
N  1.140896 -3.368566 -0.522947
C  -1.642679 0.07922 -0.001195
C  -3.050395 0.627032 0.353115
C  -1.186691 1.158702 -1.008544
C  -3.616362 1.072705 -1.009203
C  -2.400423 1.339028 -1.916499
C  -4.022473 -0.241805 1.159511
C  -1.805021 -1.331697 -0.60173
C  0.132389 0.99434 -1.764174
C  -3.451682 -0.7156 2.494113
C  -5.316846 0.532407 1.410144
C  1.353228 1.062222 -0.881815
C  0.206495 -2.676102 0.081296
C  2.232262 -0.009733 -0.769876
C  1.633773 2.212735 -0.143216
C  3.341501 0.04481 0.062439
C  2.738745 2.288309 0.686701
C  0.866374 -3.160066 -1.825937
C  3.587628 1.195905 0.789642
H  -2.853785 1.521928 0.957926
H  -1.099373 2.069957 -0.40241
H  -4.243776 1.957274 -0.905392
H  -4.257643 0.293996 -1.430952
H  -2.363609 0.635995 -2.752608
H  -2.417136 2.335421 -2.35912
H  -4.290601 -1.123306 0.563223
H  -2.321031 -1.306558 -1.560173
H  -2.419495 -1.928382 0.072513
H  0.185889 1.809063 -2.493812
H  0.135559 0.07209 -2.347018
H  0.083497 0.159612 0.903308
H  -2.57733 -1.353938 2.383798
H  -3.150087 0.132144 3.111726
H  -4.204013 -1.278942 3.048439
H  -5.119091 1.449585 1.9701
H  -6.016484 -0.063593 1.997393
H  -5.824179 0.809543 0.486165
H  0.060598 -2.587535 1.146166
H  2.060003 -0.907272 -1.347534
H  0.978949 3.07313 -0.216152
H  4.003197 -0.806549 0.140896
H  2.940047 3.188845 1.250408
H  1.440018 -3.591158 -2.631718
totalener: -1400.13928748 hartree
nucrepener: 2182.31051434 hartree
electener: -3582.44980182 hartree
oneelecener: -6248.40582625 hartree
twoeener: 2665.95602443 hartree
kineticenergy: 1395.24029587 hartree
xcener: -114.437905090382 hartree
chargesum: -0.0000000
charge: -0.079038 -0.372877 0.147172 -0.318074 -0.323396 0.476682 -0.061779 -0.023948 -0.223424 -0.210065 -0.025829 -0.341359 -0.197443 -0.250072 -0.280241 0.017422 0.015765 -0.231371 -0.185968 -0.120013 -0.125274 0.036669 0.093245 0.069691 0.094604 0.085101 0.085693 0.086879 0.082464 0.030624 0.139339 0.146261 0.106562 0.116415 0.214136 0.078042 0.084098 0.083631 0.084761 0.086167 0.086917 0.154599 0.172479 0.109631 0.127296 0.121342 0.136484
qa: -0.0790 -0.3729 0.1472 -0.3181 -0.3234 0.4767 -0.0618 -0.0239 -0.2234 -0.2101 -0.0258 -0.3414 -0.1974 -0.2501 -0.2802 0.0174 0.0158 -0.2314 -0.1860 -0.1200 -0.1253 0.0367 0.0932 0.0697 0.0946 0.0851 0.0857 0.0869 0.0825 0.0306 0.1393 0.1463 0.1066 0.1164 0.2141 0.0780 0.0841 0.0836 0.0848 0.0862 0.0869 0.1546 0.1725 0.1096 0.1273 0.1213 0.1365
va: 1.2271 2.0769 3.2858 2.8178 3.0393 3.7257 3.8068 3.8128 3.9403 3.9635 3.9282 3.9242 3.7962 3.9462 3.9341 3.5895 4.0821 3.9718 4.0306 4.0334 4.0089 4.0442 3.9137 1.0345 1.0145 1.0099 1.0057 1.0092 1.0167 1.0096 1.0057 0.9911 1.0045 1.0257 1.0529 1.0193 1.0083 1.0060 1.0035 1.0093 1.0045 1.0120 0.9846 1.0134 1.0163 1.0136 1.0021
dispcorr: -0.029173443 hartree
energy: -1400.168460919453
dipole: -45.48156 44.12831 -1.35325 2.88610 -2.04395 0.84215 -2.89537 2.50649 -0.38887
magnitude: 1.64065 au
magnitude: 4.17020 debye
