program: Orca
programVersion: 4.2.1
elementType: Cl O N N N C C C C C C C C C C C C C C C C C C H H H H H H H H H H H H H H H H H H H H H H H H
charge: 0
multiplicity: 1
keywords: wb97x-d3
keywords: def2-TZVPP
keywords: def2/J RIJCOSX GRIDX6 NOFINALGRIDX
keywords: grid4 nofinalgrid
keywords: scfconv7
keywords: smallprint printgap noloewdin
keywords: NOSOSCF
formula: C18H24ClN3O
InChI: InChI=1S/C18H24ClN3O/c1-13(2)17-8-5-15(9-14-3-6-16(19)7-4-14)18(17,23)10-22-12-20-11-21-22/h3-4,6-7,11-13,15,17,23H,5,8-10H2,1-2H3
47 atoms
Cl 5.884907 1.865475 -0.336539
O  -2.438485 -1.215939 -1.433791
N  -2.554687 1.411209 -0.048374
N  -2.843798 1.59159 -1.341963
N  -2.122999 3.507645 -0.436647
C  -1.858725 -0.958613 -0.169129
C  -1.772412 -2.306194 0.581281
C  -0.372932 -0.565341 -0.36052
C  -0.459926 -2.946048 0.056529
C  0.24077 -1.889675 -0.80893
C  -2.959656 -3.274952 0.470495
C  -2.672615 0.106206 0.576605
C  0.313549 -0.045606 0.915929
C  -2.703415 -4.484731 1.368569
C  -4.314376 -2.672815 0.826689
C  1.710329 0.431976 0.637587
C  -2.121367 2.556826 0.470711
C  2.825054 -0.324083 0.986053
C  1.918398 1.647291 -0.012144
C  4.111613 0.107236 0.692325
C  3.193623 2.096814 -0.31467
C  -2.568349 2.859215 -1.525037
C  4.283535 1.316113 0.039853
H  -1.649813 -2.070351 1.645616
H  -0.284066 0.206361 -1.133289
H  -0.665563 -3.846315 -0.52543
H  0.172552 -3.25967 0.888092
H  1.325855 -1.908788 -0.699603
H  0.033772 -2.060142 -1.865245
H  -3.010187 -3.631819 -0.563259
H  -2.34335 0.213283 1.608209
H  -3.727121 -0.158322 0.605228
H  0.339326 -0.824785 1.681431
H  -0.247396 0.783778 1.349357
H  -2.542264 -0.36985 -1.892621
H  -2.660285 -4.1883 2.419765
H  -3.503865 -5.219831 1.268637
H  -1.767599 -4.992767 1.132738
H  -4.299658 -2.195885 1.809952
H  -5.07706 -3.453326 0.860187
H  -4.649295 -1.938337 0.095821
H  -1.836996 2.662993 1.505658
H  2.695993 -1.268567 1.500273
H  1.070296 2.264307 -0.286344
H  4.964404 -0.496605 0.9708
H  3.332722 3.044004 -0.817672
H  -2.698658 3.33196 -2.485523
elementType: Cl O N C H
totalener: -1400.15920737 hartree
nucrepener: 2124.98762184 hartree
electener: -3525.14682921 hartree
oneelecener: -6133.83258353 hartree
twoeener: 2608.68575432 hartree
cpcmener: -0.02985071 hartree
kineticenergy: 1395.26687879 hartree
xcener: -114.444150306430 hartree
chargesum: -0.0000000
charge: -0.107089 -0.476092 0.146645 -0.392663 -0.417488 0.442593 -0.113175 0.067638 -0.199609 -0.239264 0.065077 -0.221358 -0.191084 -0.303446 -0.345016 0.071323 0.040606 -0.252115 -0.238920 -0.139326 -0.160168 0.086166 0.094610 0.082917 0.089385 0.079025 0.093471 0.098330 0.083624 0.030908 0.127995 0.163444 0.120008 0.115348 0.220790 0.084149 0.090973 0.093551 0.092309 0.097265 0.087773 0.187262 0.145634 0.142843 0.145585 0.144074 0.165490
qa: -0.1071 -0.4761 0.1466 -0.3927 -0.4175 0.4426 -0.1132 0.0676 -0.1996 -0.2393 0.0651 -0.2214 -0.1911 -0.3034 -0.3450 0.0713 0.0406 -0.2521 -0.2389 -0.1393 -0.1602 0.0862 0.0946 0.0829 0.0894 0.0790 0.0935 0.0983 0.0836 0.0309 0.1280 0.1634 0.1200 0.1153 0.2208 0.0841 0.0910 0.0936 0.0923 0.0973 0.0878 0.1873 0.1456 0.1428 0.1456 0.1441 0.1655
va: 1.1977 1.9679 3.2982 2.8558 2.9969 3.7058 3.7939 3.8944 3.9122 3.9931 3.8309 3.9204 3.7607 3.9339 3.9367 3.4573 4.0336 3.9871 3.9961 3.9788 4.0270 4.0074 3.8065 1.0146 1.0190 1.0064 1.0032 1.0102 1.0316 1.0270 0.9964 0.9842 1.0089 1.0188 1.0575 1.0009 1.0062 1.0042 0.9972 1.0082 1.0190 0.9869 1.0043 1.0069 1.0045 1.0070 0.9922
dispcorr: -0.027249115 hartree
energy: -1400.186456486972
dipole: -33.23877 32.48816 -0.75061 -30.55580 29.70201 -0.85379 8.81040 -7.09524 1.71516
magnitude: 2.05770 au
magnitude: 5.23026 debye
