program: Gaussian 09
title: 000030399
version: EM64L-G09RevD.01
frameworkgroup: C1[X(C9H8N4O2)]
method: RPBEPBE
basis: SDD
operation: Freq
keyword: #pfreq=noraman
keyword: PBEPBE/SDD
title: #p freq=noraman PBEPBE/SDD
converged: YES YES NO NO
title: Mulliken charges:
elementType: O O N N N N C C C C C C C C C H H H H H H H H
charge: -0.238533 -0.210759 -0.455784 -0.448059 -0.414090 -0.096227 0.447561 0.272385 -0.441890 -0.308770 0.210236 -0.198349 -0.219600 -0.248192 0.087556 0.304293 0.339415 0.215815 0.335485 0.230746 0.233612 0.369550 0.233595
chargesum: 0.00000
title: Mulliken charges with hydrogens summed into heavy atoms:
elementType: O O N N N N C C C C C C C C C
charge: -0.238533 -0.210759 -0.151491 -0.108644 -0.044540 -0.096227 0.447561 0.272385 -0.226074 0.026715 0.210236 0.032397 0.014013 -0.014596 0.087556
polarizability: 2.20476493e+02 -1.04539890e+00 1.47409631e+02 -2.84541493e-02 1.42905499e-01 5.16392260e+01
1716.lowfreq: -9.1086 -5.6416 -0.0007 -0.0006 -0.0005 3.6635 43.6820 52.2657 101.7385
frequency: 43.6519 52.2271 101.7312 116.5418 161.6788 192.5811 252.0763 254.2921 275.3827 379.6220 408.2698 471.6819 498.7528 528.6349 529.8360 555.2822 612.2235 628.1904 629.0762 654.1129 696.6641 702.8317 717.7011 725.4441 762.3778 769.2273 819.8738 844.5561 911.0045 925.5070 977.8724 985.0321 996.0549 1013.3854 1015.6605 1028.7660 1088.6340 1173.7836 1178.2655 1189.2942 1210.3451 1261.9502 1325.0039 1326.8044 1359.9743 1384.2641 1416.7282 1446.8125 1483.1058 1545.3945 1597.8241 1609.3743 1619.4999 1663.0795 1690.8045 3103.0303 3136.7135 3149.1330 3168.4285 3190.3021 3528.1645 3539.0521 3545.3559
redmass: 5.0510 5.4901 6.7897 4.6763 9.0239 8.8965 3.7578 5.8209 6.2512 11.1793 2.9385 1.5479 8.8557 5.5093 2.4388 8.7111 6.6657 1.2142 7.0904 2.6964 2.0346 2.5207 6.9429 6.8926 3.3029 1.6909 5.6114 1.2745 7.7199 1.4003 1.3464 6.0891 3.9243 1.3035 5.0481 2.1610 1.5999 1.1107 4.4826 1.1416 2.4549 2.3283 3.3199 1.5488 1.6988 4.6394 2.3563 2.5324 2.3451 2.4487 6.5601 3.6465 5.2072 7.7507 6.3719 1.0895 1.0867 1.0931 1.0996 1.0960 1.0764 1.0778 1.0778
irintensity: 0.3530 0.3052 2.7579 0.0660 6.0030 6.3023 1.5650 2.1436 0.0011 21.1887 0.0006 1.6340 7.0679 8.4503 29.3886 0.8703 0.4552 102.2173 18.1333 43.4485 53.9291 0.6649 5.3641 5.1677 118.8941 148.9214 0.2645 0.0967 5.2766 12.4565 0.2917 0.2018 6.2875 3.7922 21.0552 18.1638 7.8388 5.0415 185.7893 0.7652 27.1303 128.4630 89.5279 115.4088 52.2623 36.0031 51.3427 43.3461 71.4300 540.6073 983.4261 3.9014 223.5197 307.0045 587.9897 16.6293 0.5946 24.7753 18.8229 21.3221 23.9554 57.1376 72.9117
temp: 298.150 k
press: 1.00000 atm
elementType: 8 8 7 7 7 7 6 6 6 6 6 6 6 6 6 1 1 1 1 1 1 1 1
symmnumber: 1
zpe: 443628.7 jmol-1
zpe.correction: 0.168969 hartree
zpe.thermalcorrener: 0.181051 hartree
zpe.thermalcorrenthalpy: 0.181996 hartree
zpe.thermalcorrgfe: 0.129619 hartree
zpe.sumelectzpe: -716.200524 hartree
zpe.sumelectthermal: -716.188442 hartree
zpe.sumelectthermalent: -716.187498 hartree
zpe.sumelectthermalfe: -716.239874 hartree
dipole: 3.9311 -4.8917 0.0109
dipole: 6.2755
quadrupole: -88.9053 -87.9197 -89.9307
quadrupole: -2.7348 0.0110 0.0783
quadrupole: 0.0133 0.9988 -1.0122 -2.7348 0.0110 0.0783
hfenergy: -716.3694931 hartree
pointgroup: C01 [X(C9H8N4O2)]
dipole: 1.5417854 -1.9079511 0.2801906 debye
dipolederiv: -1.2117383 -0.4136316 0.0492519 -0.5150039 -0.821994 0.0564818 0.0642215 0.057867 -0.3894991 -0.7249139 0.2185112 -0.0337173 0.3608844 -1.2248661 0.1214221 -0.0537505 0.1197317 -0.3860085 -1.9737038 0.1422008 -0.0365764 0.4323718 -0.3744161 0.0128793 -0.0762526 0.0110458 -0.3344952 -1.8261149 -0.2935251 0.0259985 -0.198733 -0.5945447 0.0342582 0.0133216 0.0331846 -0.3244777 -0.9047691 -0.2829487 0.0335968 -0.3974541 -1.1996041 0.1143623 0.0471153 0.11542 -0.3676418 -1.4311577 0.482859 -0.0786789 1.0580521 -1.1689687 0.1346315 -0.1538929 0.1262313 -0.299764 1.1707109 0.1159377 -0.0043906 0.5033641 0.0915089 0.0046935 -0.0586922 0.000943 0.0860324 2.3757828 -0.0057609 0.0188846 -0.9041645 1.4396436 -0.1729332 0.1354453 -0.1630622 0.3008724 -0.2782251 -0.0172804 0.0013525 0.0347944 0.0609569 -0.0342371 -0.0050225 -0.0344527 -0.2045028 -0.2450777 -0.0381519 0.0044893 -0.1842088 -0.1129118 -0.005328 0.0241882 -0.0050604 -0.1386886 2.1577991 0.3649819 -0.0308108 0.2954744 1.4443245 -0.1546362 -0.0211936 -0.1536954 0.3503412 0.0960048 -0.0324372 0.0065174 -0.133862 0.0707242 -0.0280943 0.018569 -0.0269441 -0.1341421 0.0129358 0.0205547 -0.0015112 0.098332 0.1639716 -0.0376048 -0.010909 -0.0386147 -0.1338892 -0.0425184 0.0686596 -0.0073346 0.0497402 -0.0946054 -0.0096327 -0.0043058 -0.0092761 -0.1711457 2.1420378 -0.2560808 0.0548388 -0.377622 1.8694482 -0.218134 0.0722628 -0.2148701 0.332648 0.1407654 0.0029576 -0.0019247 -0.0934782 0.1257902 0.0223222 0.0140982 0.0220373 0.3013319 0.141513 0.0026667 -0.0027824 0.0438442 0.1857989 0.025148 -0.0082572 0.0256164 0.3514811 0.0661882 -0.0931136 0.0110403 -0.0625084 -0.1095996 0.0350827 0.0077401 0.0347441 0.1651121 0.2154206 0.0466121 -0.0054081 0.0668242 0.0839955 0.0123479 -0.0076513 0.0124665 0.171659 -0.0471953 0.0971185 -0.0144464 0.1133214 0.0022982 0.0212089 -0.0165049 0.0210689 0.1564791 0.0666648 -0.0230134 0.0019299 -0.0600631 -0.0880971 0.0303195 0.0065117 0.030879 0.149786 0.2087245 -0.0432114 0.0044085 -0.0619699 0.1803542 0.0237716 0.0072125 0.0230836 0.3520979 -0.1091335 -0.0639047 0.0052729 -0.0679351 0.0707924 0.0116707 0.0057462 0.0116566 0.1664136 unknown
polarizability: 220.4528108|-0.9774473|145.7113452|1.9003073|-12.65964|53.3611936 unknown
InChI: InChI=1S/C9H8N4O2/c14-8-11-7(12-9(15)13-8)10-6-4-2-1-3-5-6/h1-5,10-11,13H
charge 0 multiplicity 1
23 atoms
O  -4.218609 -1.649638 0.149925
O  -2.455186 2.652341 -0.428286
N  0.430068 -1.047716 0.108955
N  -1.90163 -1.315498 0.130135
N  -3.331619 0.512264 -0.146479
N  -0.942826 0.869195 -0.169381
C  1.739998 -0.473909 0.045329
C  -0.802638 -0.4387 0.015041
C  2.827467 -1.38004 0.172448
C  1.986608 0.911868 -0.130807
C  -3.243495 -0.864817 0.050082
C  4.153414 -0.906464 0.124077
C  3.322156 1.368247 -0.175697
C  4.409293 0.473883 -0.04986
C  -2.223636 1.432076 -0.259417
H  0.42846 -2.061923 0.239651
H  -1.79854 -2.321728 0.281237
H  2.638675 -2.453898 0.308012
H  1.142868 1.596425 -0.230528
H  4.983464 -1.614236 0.222462
H  3.508565 2.439166 -0.3111
H  -4.270563 0.91391 -0.214142
H  5.439306 0.843591 -0.086258
