program: Orca
programVersion: 4.2.1
elementType: Cl O N N N C C C C C C C C C C C C C C C C C C H H H H H H H H H H H H H H H H H H H H H H H H
charge: 0
multiplicity: 1
keywords: wb97x-d3
keywords: def2-TZVPP
keywords: def2/J RIJCOSX GRIDX6 NOFINALGRIDX
keywords: grid4 nofinalgrid
keywords: scfconv7
keywords: smallprint printgap noloewdin
keywords: NOSOSCF
formula: C18H24ClN3O
InChI: InChI=1S/C18H24ClN3O/c1-13(2)17-8-5-15(9-14-3-6-16(19)7-4-14)18(17,23)10-22-12-20-11-21-22/h3-4,6-7,11-13,15,17,23H,5,8-10H2,1-2H3
47 atoms
Cl 6.185162 0.802326 -0.253358
O  -2.300487 -0.831109 -1.35702
N  -2.758961 1.570678 0.258886
N  -2.928578 1.833606 -1.039699
N  -2.698746 3.73458 0.103209
C  -1.901889 -0.799981 -0.008383
C  -2.157667 -2.185394 0.691436
C  -0.375088 -0.586908 0.139518
C  -0.813877 -2.604692 1.307545
C  -0.024061 -1.30903 1.43232
C  -2.855412 -3.25808 -0.157484
C  -2.770345 0.211597 0.767181
C  0.168594 0.838484 0.028597
C  -1.994735 -3.861296 -1.265696
C  -3.377667 -4.373513 0.745778
C  1.669891 0.854731 -0.040307
C  -2.6285 2.714805 0.927968
C  2.327568 0.577543 -1.236527
C  2.442521 1.115254 1.087437
C  3.71159 0.558848 -1.312605
C  3.828999 1.100451 1.033632
C  -2.877284 3.142009 -1.089305
C  4.452959 0.820601 -0.170787
H  -2.838019 -1.988627 1.528912
H  0.064336 -1.169515 -0.680851
H  -0.272296 -3.284077 0.644587
H  -0.939788 -3.123982 2.258446
H  -0.351466 -0.728136 2.301632
H  1.047312 -1.476316 1.547714
H  -3.724637 -2.786814 -0.626914
H  -2.462021 0.263899 1.810675
H  -3.804446 -0.142056 0.756107
H  -0.148445 1.434241 0.887007
H  -0.230912 1.321746 -0.866428
H  -2.464724 0.076151 -1.659435
H  -2.607384 -4.489023 -1.916618
H  -1.523968 -3.107077 -1.894438
H  -1.204914 -4.501726 -0.867149
H  -4.052773 -3.992175 1.515154
H  -2.56421 -4.898805 1.252392
H  -3.930558 -5.118635 0.169495
H  -2.482013 2.757376 1.996045
H  1.752457 0.376676 -2.133029
H  1.959047 1.338305 2.031207
H  4.203035 0.346176 -2.252632
H  4.410566 1.307733 1.92202
H  -2.975887 3.682163 -2.01788
elementType: Cl O N C H
totalener: -1400.16857961 hartree
nucrepener: 2105.91315839 hartree
electener: -3506.08173800 hartree
oneelecener: -6095.84831615 hartree
twoeener: 2589.76657815 hartree
cpcmener: -0.02577732 hartree
kineticenergy: 1395.24335823 hartree
xcener: -114.438854143276 hartree
chargesum: -0.0000000
charge: -0.105919 -0.436692 0.130421 -0.380411 -0.402627 0.426484 -0.078956 -0.003367 -0.204593 -0.233378 0.082368 -0.203721 -0.082238 -0.330439 -0.306255 0.002047 0.056328 -0.220429 -0.215327 -0.170459 -0.155414 0.083775 0.105862 0.081670 0.077893 0.097151 0.084599 0.079290 0.082602 0.026378 0.123801 0.139792 0.087966 0.108499 0.211615 0.097245 0.095793 0.077566 0.087943 0.083615 0.093469 0.180063 0.141240 0.135898 0.142554 0.141873 0.164425
qa: -0.1059 -0.4367 0.1304 -0.3804 -0.4026 0.4265 -0.0790 -0.0034 -0.2046 -0.2334 0.0824 -0.2037 -0.0822 -0.3304 -0.3063 0.0020 0.0563 -0.2204 -0.2153 -0.1705 -0.1554 0.0838 0.1059 0.0817 0.0779 0.0972 0.0846 0.0793 0.0826 0.0264 0.1238 0.1398 0.0880 0.1085 0.2116 0.0972 0.0958 0.0776 0.0879 0.0836 0.0935 0.1801 0.1412 0.1359 0.1426 0.1419 0.1644
va: 1.1994 1.9736 3.3271 2.8617 3.0376 3.7669 3.8534 3.8206 3.9815 3.9925 3.8014 3.9605 3.7541 3.9164 3.9355 3.5615 4.0415 3.9895 3.9606 4.0054 3.9996 4.0076 3.8139 1.0051 1.0276 0.9994 1.0123 1.0064 1.0163 1.0423 0.9914 0.9949 1.0095 1.0236 1.0811 1.0039 1.0273 1.0004 1.0044 0.9999 1.0032 0.9908 1.0062 1.0067 1.0063 1.0062 0.9930
dispcorr: -0.026507025 hartree
energy: -1400.195086633839
dipole: -32.06713 31.05627 -1.01086 -27.38003 26.86368 -0.51635 5.65918 -4.10790 1.55127
magnitude: 1.92221 au
magnitude: 4.88588 debye
