program: Orca
programVersion: 4.2.1
elementType: Cl O N N N C C C C C C C C C C C C C C C C C C H H H H H H H H H H H H H H H H H H H H H H H H
charge: 0
multiplicity: 1
keywords: wb97x-d3
keywords: def2-TZVPP
keywords: def2/J RIJCOSX GRIDX6 NOFINALGRIDX
keywords: grid4 nofinalgrid
keywords: scfconv7
keywords: smallprint printgap noloewdin
keywords: NOSOSCF
formula: C18H24ClN3O
InChI: InChI=1S/C18H24ClN3O/c1-13(2)17-8-5-15(9-14-3-6-16(19)7-4-14)18(17,23)10-22-12-20-11-21-22/h3-4,6-7,11-13,15,17,23H,5,8-10H2,1-2H3
47 atoms
Cl 3.972328 3.352834 1.084445
O  -2.569491 -0.785409 -1.298134
N  -0.928131 1.172149 0.207562
N  -1.310532 1.657533 -0.975729
N  -0.233728 3.229153 0.186759
C  -1.499132 -1.173506 -0.462125
C  -1.828659 -2.563007 0.114026
C  -0.270923 -1.476675 -1.357497
C  -1.72564 -3.472882 -1.114851
C  -0.691135 -2.799244 -2.038482
C  -3.078386 -2.731571 0.994419
C  -1.311218 -0.153318 0.660344
C  1.075664 -1.642722 -0.637539
C  -4.421825 -2.617071 0.280203
C  -3.001067 -4.064482 1.737989
C  1.772253 -0.382574 -0.200139
C  -0.291931 2.122372 0.891472
C  2.017264 0.653178 -1.100458
C  2.236517 -0.237072 1.103216
C  2.69005 1.800057 -0.715265
C  2.918987 0.902403 1.507983
C  -0.868736 2.891218 -0.947942
C  3.13682 1.915914 0.591897
H  -0.984452 -2.808683 0.769597
H  -0.161344 -0.687342 -2.106395
H  -2.688321 -3.558294 -1.620067
H  -1.429112 -4.485098 -0.837759
H  0.176604 -3.439317 -2.20679
H  -1.121193 -2.60406 -3.020883
H  -3.048589 -1.947191 1.759285
H  -0.557012 -0.486708 1.372831
H  -2.249849 -0.058252 1.210731
H  1.744514 -2.162638 -1.330378
H  0.974379 -2.314872 0.218629
H  -2.351358 0.09238 -1.647674
H  -4.549138 -3.391948 -0.478484
H  -5.235474 -2.740327 0.998284
H  -4.554786 -1.653175 -0.204854
H  -2.078079 -4.151749 2.315665
H  -3.042837 -4.914272 1.052723
H  -3.833001 -4.171503 2.436872
H  0.107731 1.965747 1.880778
H  1.680359 0.571978 -2.126684
H  2.068602 -1.0279 1.825187
H  2.861219 2.595157 -1.428378
H  3.269614 0.993834 2.527384
H  -1.01027 3.566739 -1.777169
elementType: Cl O N C H
totalener: -1400.16422234 hartree
nucrepener: 2215.08876910 hartree
electener: -3615.25299144 hartree
oneelecener: -6314.44564527 hartree
twoeener: 2699.19265383 hartree
cpcmener: -0.02392120 hartree
kineticenergy: 1395.25644800 hartree
xcener: -114.447731932361 hartree
chargesum: -0.0000000
charge: -0.107185 -0.463910 0.183588 -0.377332 -0.392243 0.549939 -0.110932 0.041304 -0.218732 -0.220948 0.030871 -0.311904 -0.217577 -0.309006 -0.308988 0.052350 0.032718 -0.185487 -0.172088 -0.203566 -0.218914 0.061598 0.184735 0.093027 0.077436 0.096554 0.086162 0.077857 0.088831 0.039298 0.137348 0.146487 0.101359 0.114203 0.214357 0.076576 0.093095 0.092149 0.088203 0.086578 0.093988 0.171499 0.133730 0.139371 0.133066 0.139106 0.161430
qa: -0.1072 -0.4639 0.1836 -0.3773 -0.3922 0.5499 -0.1109 0.0413 -0.2187 -0.2209 0.0309 -0.3119 -0.2176 -0.3090 -0.3090 0.0524 0.0327 -0.1855 -0.1721 -0.2036 -0.2189 0.0616 0.1847 0.0930 0.0774 0.0966 0.0862 0.0779 0.0888 0.0393 0.1373 0.1465 0.1014 0.1142 0.2144 0.0766 0.0931 0.0921 0.0882 0.0866 0.0940 0.1715 0.1337 0.1394 0.1331 0.1391 0.1614
va: 1.1990 1.9958 3.2588 2.8689 3.0178 3.5815 3.8706 3.8529 3.9352 4.0240 3.8599 4.0209 3.8699 3.9079 3.9246 3.4884 4.0689 3.8843 3.8996 4.0154 4.0118 4.0299 3.6970 1.0041 1.0344 1.0066 1.0105 1.0105 1.0118 1.0141 0.9860 0.9918 1.0058 0.9946 1.0669 1.0017 1.0038 1.0336 1.0034 0.9995 1.0041 0.9911 1.0084 1.0033 1.0132 1.0088 0.9943
dispcorr: -0.030447623 hartree
energy: -1400.194669966876
dipole: -29.85957 29.96454 0.10497 -38.86511 37.16108 -1.70403 -1.92003 2.60772 0.68768
magnitude: 1.84055 au
magnitude: 4.67832 debye
