program: Orca
programVersion: 4.2.1
elementType: Cl O N N N C C C C C C C C C C C C C C C C C C H H H H H H H H H H H H H H H H H H H H H H H H
charge: 0
multiplicity: 1
keywords: wb97x-d3
keywords: def2-TZVPP
keywords: def2/J RIJCOSX GRIDX6 NOFINALGRIDX
keywords: grid4 nofinalgrid
keywords: scfconv7
keywords: smallprint printgap noloewdin
keywords: NOSOSCF
formula: C18H24ClN3O
InChI: InChI=1S/C18H24ClN3O/c1-13(2)17-8-5-15(9-14-3-6-16(19)7-4-14)18(17,23)10-22-12-20-11-21-22/h3-4,6-7,11-13,15,17,23H,5,8-10H2,1-2H3
47 atoms
Cl 5.822344 1.938927 -0.585342
O  -2.384987 -1.379461 -1.305483
N  -2.41043 1.342947 -0.045147
N  -2.526552 1.471236 -1.36935
N  -1.970363 3.429541 -0.451457
C  -1.822442 -1.061624 -0.049904
C  -1.763338 -2.352208 0.786053
C  -0.319775 -0.746312 -0.255522
C  -0.633474 -3.149411 0.107111
C  0.244227 -2.123258 -0.635927
C  -3.018265 -3.196457 1.071974
C  -2.625912 0.064716 0.607637
C  0.396918 -0.163795 0.975741
C  -3.948334 -2.563948 2.104918
C  -3.821184 -3.655599 -0.141936
C  1.759916 0.36262 0.622727
C  -2.08102 2.518543 0.48922
C  2.920655 -0.338212 0.933974
C  1.888213 1.569584 -0.063334
C  4.173027 0.13717 0.568173
C  3.127635 2.062619 -0.436173
C  -2.252067 2.737205 -1.568982
C  4.264979 1.335388 -0.118696
H  -1.395359 -2.046013 1.772592
H  -0.202992 -0.03356 -1.078406
H  -1.037467 -3.885278 -0.590154
H  -0.068983 -3.712075 0.852507
H  1.299931 -2.213611 -0.375334
H  0.183898 -2.273309 -1.713588
H  -2.61708 -4.102875 1.542918
H  -2.365729 0.193449 1.6570
H  -3.691103 -0.162918 0.562229
H  0.489311 -0.920637 1.758558
H  -0.181885 0.652966 1.412346
H  -2.402039 -0.569066 -1.835454
H  -4.702315 -3.28291 2.431834
H  -3.407055 -2.236632 2.995216
H  -4.49048 -1.703999 1.709236
H  -3.195553 -4.088441 -0.922974
H  -4.392429 -2.842358 -0.587611
H  -4.533564 -4.42646 0.160758
H  -1.936839 2.663538 1.548585
H  2.857443 -1.273213 1.477497
H  1.005531 2.148215 -0.311434
H  5.062313 -0.425246 0.819048
H  3.202381 3.002933 -0.965641
H  -2.254696 3.172721 -2.55601
elementType: Cl O N C H
totalener: -1400.16587490 hartree
nucrepener: 2130.95037479 hartree
electener: -3531.11624968 hartree
oneelecener: -6145.87658113 hartree
twoeener: 2614.76033145 hartree
cpcmener: -0.02473341 hartree
kineticenergy: 1395.23943948 hartree
xcener: -114.438030416849 hartree
chargesum: -0.0000000
charge: -0.104558 -0.444709 0.154002 -0.388030 -0.410001 0.479587 -0.063741 0.023329 -0.209733 -0.235696 0.003641 -0.249271 -0.176010 -0.326742 -0.287370 0.061389 0.035008 -0.234703 -0.231603 -0.141003 -0.161386 0.082252 0.095582 0.085962 0.086240 0.090364 0.085961 0.092182 0.088399 0.046474 0.128968 0.151063 0.110275 0.111171 0.212277 0.101147 0.096379 0.082414 0.087867 0.069769 0.094736 0.178043 0.143663 0.138795 0.142288 0.141168 0.164163
qa: -0.1046 -0.4447 0.1540 -0.3880 -0.4100 0.4796 -0.0637 0.0233 -0.2097 -0.2357 0.0036 -0.2493 -0.1760 -0.3267 -0.2874 0.0614 0.0350 -0.2347 -0.2316 -0.1410 -0.1614 0.0823 0.0956 0.0860 0.0862 0.0904 0.0860 0.0922 0.0884 0.0465 0.1290 0.1511 0.1103 0.1112 0.2123 0.1011 0.0964 0.0824 0.0879 0.0698 0.0947 0.1780 0.1437 0.1388 0.1423 0.1412 0.1642
va: 1.2003 2.0053 3.2951 2.8510 2.9993 3.6485 3.8544 3.8761 3.9256 4.0033 3.8870 3.9504 3.7545 3.9271 3.9238 3.4881 4.0489 3.9876 3.9861 3.9865 4.0392 4.0024 3.8159 1.0149 1.0263 1.0074 1.0117 1.0128 1.0213 1.0036 0.9895 0.9930 1.0150 1.0134 1.0597 1.0027 1.0041 1.0027 1.0106 1.0196 1.0023 0.9913 1.0033 1.0071 1.0057 1.0078 0.9922
dispcorr: -0.027614167 hartree
energy: -1400.193489061755
dipole: -34.90579 34.11348 -0.79231 -29.37017 28.53215 -0.83802 9.78364 -8.09427 1.68936
magnitude: 2.04547 au
magnitude: 5.19918 debye
