program: Orca
programVersion: 4.2.1
elementType: Cl O N N N C C C C C C C C C C C C C C C C C C H H H H H H H H H H H H H H H H H H H H H H H H
charge: 0
multiplicity: 1
keywords: wb97x-d3
keywords: def2-TZVPP
keywords: def2/J RIJCOSX GRIDX6 NOFINALGRIDX
keywords: grid4 nofinalgrid
keywords: scfconv7
keywords: smallprint printgap noloewdin
keywords: NOSOSCF
formula: C18H24ClN3O
InChI: InChI=1S/C18H24ClN3O/c1-13(2)17-8-5-15(9-14-3-6-16(19)7-4-14)18(17,23)10-22-12-20-11-21-22/h3-4,6-7,11-13,15,17,23H,5,8-10H2,1-2H3
47 atoms
Cl 6.839348 -0.093268 -0.108321
O  -1.529852 -0.039786 -1.601301
N  -3.352237 1.383093 0.238827
N  -3.873426 1.557541 -0.979688
N  -5.499237 1.518882 0.555687
C  -1.369455 -0.059207 -0.209745
C  -1.965498 -1.314898 0.538684
C  0.148027 -0.145935 0.061242
C  -0.7742 -1.909663 1.318737
C  0.251187 -0.791861 1.430656
C  -2.688047 -2.358648 -0.326482
C  -1.925623 1.238024 0.407314
C  0.947959 1.140492 -0.14036
C  -2.971309 -3.621519 0.489813
C  -4.012836 -1.857492 -0.896034
C  2.426683 0.872726 -0.134854
C  -4.338266 1.360942 1.142497
C  3.05496 0.360722 -1.266632
C  3.197832 1.081261 1.002701
C  4.407256 0.06248 -1.268261
C  4.552965 0.787747 1.021607
C  -5.162988 1.63091 -0.741548
C  5.150547 0.277191 -0.118124
H  -2.701411 -0.967308 1.276477
H  0.519228 -0.877224 -0.668221
H  -0.328214 -2.728784 0.746692
H  -1.071379 -2.324836 2.282028
H  -0.01491 -0.082354 2.222962
H  1.25462 -1.154629 1.655047
H  -2.029912 -2.629633 -1.159072
H  -1.455574 2.10977 -0.050294
H  -1.719331 1.272631 1.477667
H  0.713479 1.866968 0.643103
H  0.661342 1.59446 -1.093015
H  -2.361232 0.394552 -1.833724
H  -3.504334 -4.35573 -0.115637
H  -2.066807 -4.105571 0.85618
H  -3.601135 -3.396935 1.354566
H  -4.676693 -1.509774 -0.100077
H  -4.532215 -2.66332 -1.417198
H  -3.89872 -1.047839 -1.610425
H  -4.166234 1.239131 2.201026
H  2.476859 0.19284 -2.167885
H  2.734779 1.481202 1.896966
H  4.881178 -0.331486 -2.156707
H  5.138635 0.956414 1.914724
H  -5.881239 1.772209 -1.533547
totalener: -1400.14293207 hartree
nucrepener: 2089.03610426 hartree
electener: -3489.17903633 hartree
oneelecener: -6061.86793852 hartree
twoeener: 2572.68890219 hartree
kineticenergy: 1395.24710682 hartree
xcener: -114.435938035576 hartree
chargesum: 0.0000000
charge: -0.084626 -0.364529 0.146875 -0.363739 -0.321964 0.434929 -0.116090 0.003565 -0.186096 -0.214970 0.085432 -0.270735 -0.105777 -0.279927 -0.319035 0.024164 0.030556 -0.200157 -0.195070 -0.139306 -0.130800 0.085450 0.093616 0.064370 0.070848 0.084214 0.087363 0.060801 0.088278 0.040109 0.136145 0.111192 0.071682 0.112193 0.196611 0.086309 0.083717 0.082451 0.080278 0.089171 0.088934 0.141999 0.125042 0.109981 0.121170 0.119468 0.135910
qa: -0.0846 -0.3645 0.1469 -0.3637 -0.3220 0.4349 -0.1161 0.0036 -0.1861 -0.2150 0.0854 -0.2707 -0.1058 -0.2799 -0.3190 0.0242 0.0306 -0.2002 -0.1951 -0.1393 -0.1308 0.0855 0.0936 0.0644 0.0708 0.0842 0.0874 0.0608 0.0883 0.0401 0.1361 0.1112 0.0717 0.1122 0.1966 0.0863 0.0837 0.0825 0.0803 0.0892 0.0889 0.1420 0.1250 0.1100 0.1212 0.1195 0.1359
va: 1.2222 2.0853 3.2837 2.8312 3.0548 3.7290 3.8520 3.7493 3.9704 4.0038 3.8293 3.9874 3.7743 3.9279 3.9417 3.6023 4.0692 4.0180 3.9840 4.0201 4.0249 4.0179 3.9196 1.0189 1.0421 1.0070 1.0089 1.0105 1.0205 1.0259 0.9966 0.9939 1.0081 1.0242 1.0809 1.0106 1.0075 1.0013 1.0040 1.0126 1.0289 1.0018 1.0109 1.0122 1.0127 1.0127 1.0015
dispcorr: -0.026894171 hartree
energy: -1400.169826245005
dipole: -33.38496 33.24379 -0.14117 -14.46135 14.53252 0.07116 4.43339 -3.68414 0.74926
magnitude: 0.76575 au
magnitude: 1.94639 debye
