program: Orca
programVersion: 4.2.1
elementType: Cl O N N N C C C C C C C C C C C C C C C C C C H H H H H H H H H H H H H H H H H H H H H H H H
charge: 0
multiplicity: 1
keywords: wb97x-d3
keywords: def2-TZVPP
keywords: def2/J RIJCOSX GRIDX6 NOFINALGRIDX
keywords: grid4 nofinalgrid
keywords: scfconv7
keywords: smallprint printgap noloewdin
keywords: NOSOSCF
formula: C18H24ClN3O
InChI: InChI=1S/C18H24ClN3O/c1-13(2)17-8-5-15(9-14-3-6-16(19)7-4-14)18(17,23)10-22-12-20-11-21-22/h3-4,6-7,11-13,15,17,23H,5,8-10H2,1-2H3
47 atoms
Cl 3.987791 2.998479 1.674389
O  -2.66842 -0.660073 -1.377571
N  -0.985239 1.177025 0.218148
N  -1.430051 1.761328 -0.899096
N  -0.249559 3.222214 0.310501
C  -1.560364 -1.100222 -0.629473
C  -1.873929 -2.563018 -0.240579
C  -0.346753 -1.263696 -1.580182
C  -1.821995 -3.248734 -1.614966
C  -0.785008 -2.466982 -2.442134
C  -3.153716 -2.807066 0.583653
C  -1.361947 -0.179091 0.575566
C  1.012926 -1.550254 -0.922611
C  -3.766793 -4.181691 0.313556
C  -2.891776 -2.69871 2.087182
C  1.723516 -0.39935 -0.263242
C  -0.287564 2.067343 0.930128
C  2.023476 0.761997 -0.972034
C  2.155671 -0.484048 1.055745
C  2.714948 1.807592 -0.386464
C  2.856337 0.550981 1.659245
C  -0.958655 2.983127 -0.805119
C  3.130275 1.696149 0.931833
H  -1.029758 -2.937724 0.353221
H  -0.24303 -0.367172 -2.197392
H  -2.797251 -3.197231 -2.097837
H  -1.569206 -4.305388 -1.523847
H  0.072414 -3.088238 -2.707134
H  -1.222162 -2.12852 -3.38033
H  -3.893714 -2.053817 0.296292
H  -0.596315 -0.561558 1.250886
H  -2.301822 -0.128483 1.128575
H  1.670149 -1.927536 -1.712307
H  0.927036 -2.376437 -0.211105
H  -2.502441 0.262559 -1.622491
H  -3.059246 -4.984737 0.533604
H  -4.640956 -4.337738 0.947588
H  -4.093767 -4.298519 -0.718277
H  -2.462296 -1.744662 2.389544
H  -2.202269 -3.481255 2.413458
H  -3.815818 -2.824202 2.653294
H  0.18375 1.830948 1.871207
H  1.707235 0.861393 -2.003327
H  1.953399 -1.38249 1.627797
H  2.921507 2.70886 -0.945899
H  3.18911 0.463719 2.684642
H  -1.139711 3.723407 -1.568502
totalener: -1400.13757367 hartree
nucrepener: 2215.80638541 hartree
electener: -3615.94395909 hartree
oneelecener: -6315.78503888 hartree
twoeener: 2699.84107979 hartree
kineticenergy: 1395.25490717 hartree
xcener: -114.445175422673 hartree
chargesum: 0.0000000
charge: -0.075973 -0.395918 0.177359 -0.353932 -0.322611 0.523476 -0.101230 0.054450 -0.180596 -0.214765 -0.020910 -0.357129 -0.268704 -0.283100 -0.284666 0.067037 0.013836 -0.142206 -0.154473 -0.173827 -0.232783 0.061443 0.173144 0.079574 0.075086 0.094434 0.086684 0.070495 0.088914 0.059787 0.124400 0.143120 0.103609 0.110249 0.195239 0.080501 0.085019 0.088848 0.079104 0.076759 0.090771 0.150719 0.116145 0.118827 0.117836 0.121949 0.134011
qa: -0.0760 -0.3959 0.1774 -0.3539 -0.3226 0.5235 -0.1012 0.0545 -0.1806 -0.2148 -0.0209 -0.3571 -0.2687 -0.2831 -0.2847 0.0670 0.0138 -0.1422 -0.1545 -0.1738 -0.2328 0.0614 0.1731 0.0796 0.0751 0.0944 0.0867 0.0705 0.0889 0.0598 0.1244 0.1431 0.1036 0.1102 0.1952 0.0805 0.0850 0.0888 0.0791 0.0768 0.0908 0.1507 0.1161 0.1188 0.1178 0.1219 0.1340
va: 1.2312 2.0839 3.2474 2.8758 3.0386 3.6445 3.8638 3.8367 3.9194 4.0585 3.8550 4.0310 3.8695 3.9294 3.9280 3.5259 4.0732 3.8768 3.8795 4.0398 4.0481 4.0457 3.8159 1.0036 1.0337 1.0179 1.0074 1.0096 1.0124 1.0349 0.9806 0.9870 1.0060 0.9944 1.0892 1.0017 1.0081 1.0077 1.0084 1.0044 1.0100 0.9971 1.0122 1.0084 1.0184 1.0166 1.0017
dispcorr: -0.030262131 hartree
energy: -1400.167835805966
dipole: -28.67518 28.67890 0.00372 -37.29701 36.16366 -1.13335 -5.21758 5.35761 0.14003
magnitude: 1.14198 au
magnitude: 2.90268 debye
