program: Orca
programVersion: 4.2.1
elementType: Cl O N N N C C C C C C C C C C C C C C C C C C H H H H H H H H H H H H H H H H H H H H H H H H
charge: 0
multiplicity: 1
keywords: wb97x-d3
keywords: def2-TZVPP
keywords: def2/J RIJCOSX GRIDX6 NOFINALGRIDX
keywords: grid4 nofinalgrid
keywords: scfconv7
keywords: smallprint printgap noloewdin
keywords: NOSOSCF
formula: C18H24ClN3O
InChI: InChI=1S/C18H24ClN3O/c1-13(2)17-8-5-15(9-14-3-6-16(19)7-4-14)18(17,23)10-22-12-20-11-21-22/h3-4,6-7,11-13,15,17,23H,5,8-10H2,1-2H3
47 atoms
Cl 5.815933 1.998231 -0.525304
O  -2.548067 -1.111556 -1.367335
N  -2.436872 1.435524 0.195542
N  -2.691047 1.705775 -1.08803
N  -1.955349 3.543418 -0.049171
C  -1.885705 -0.952253 -0.138288
C  -1.810889 -2.349051 0.520932
C  -0.3974 -0.599747 -0.387447
C  -0.552837 -2.997298 -0.116567
C  0.133748 -1.912012 -0.95775
C  -3.039777 -3.2642 0.406102
C  -2.610255 0.095271 0.722526
C  0.388147 -0.195757 0.873682
C  -2.793683 -4.539195 1.213282
C  -4.35476 -2.635793 0.85518
C  1.751463 0.342656 0.542389
C  -1.999701 2.545447 0.800102
C  2.902065 -0.4151 0.724063
C  1.888036 1.628028 0.022895
C  4.154838 0.083301 0.397755
C  3.129599 2.143225 -0.307431
C  -2.388146 2.979353 -1.190859
C  4.260238 1.363161 -0.11823
H  -1.623108 -2.192898 1.592139
H  -0.31912 0.215923 -1.113462
H  -0.826091 -3.850271 -0.739543
H  0.113203 -3.386745 0.655383
H  1.222462 -1.972492 -0.92639
H  -0.156182 -2.004751 -2.003533
H  -3.147996 -3.540522 -0.646965
H  -2.234635 0.10019 1.745266
H  -3.676189 -0.119777 0.769918
H  0.486214 -1.050807 1.548315
H  -0.143627 0.571684 1.43931
H  -2.649273 -0.237661 -1.770714
H  -1.886824 -5.06036 0.906616
H  -2.69942 -4.314783 2.278867
H  -3.623058 -5.238617 1.099859
H  -4.679881 -1.844675 0.18206
H  -4.287584 -2.230926 1.868851
H  -5.147464 -3.385757 0.866205
H  -1.730654 2.58172 1.844911
H  2.825144 -1.415242 1.133829
H  1.009152 2.247046 -0.122518
H  5.040479 -0.518721 0.546854
H  3.219009 3.144874 -0.704633
H  -2.483474 3.51485 -2.122234
totalener: -1400.14278137 hartree
nucrepener: 2127.74841021 hartree
electener: -3527.89119158 hartree
oneelecener: -6139.34876774 hartree
twoeener: 2611.45757616 hartree
kineticenergy: 1395.24824456 hartree
xcener: -114.437498911198 hartree
chargesum: -0.0000000
charge: -0.084147 -0.387139 0.157451 -0.354442 -0.332997 0.449582 -0.129281 0.060138 -0.206803 -0.214068 0.066775 -0.266408 -0.222261 -0.273013 -0.336381 0.096687 0.009271 -0.223088 -0.212422 -0.121688 -0.145418 0.081433 0.091601 0.067764 0.091177 0.076416 0.085398 0.092256 0.090351 0.045562 0.109422 0.152559 0.112102 0.091188 0.193464 0.088192 0.074358 0.084771 0.097209 0.078118 0.090259 0.146841 0.118432 0.131633 0.119954 0.121670 0.137524
qa: -0.0841 -0.3871 0.1575 -0.3544 -0.3330 0.4496 -0.1293 0.0601 -0.2068 -0.2141 0.0668 -0.2664 -0.2223 -0.2730 -0.3364 0.0967 0.0093 -0.2231 -0.2124 -0.1217 -0.1454 0.0814 0.0916 0.0678 0.0912 0.0764 0.0854 0.0923 0.0904 0.0456 0.1094 0.1526 0.1121 0.0912 0.1935 0.0882 0.0744 0.0848 0.0972 0.0781 0.0903 0.1468 0.1184 0.1316 0.1200 0.1217 0.1375
va: 1.2219 2.0696 3.2655 2.8612 3.0302 3.6892 3.8331 3.8793 3.9238 3.9928 3.8468 3.9340 3.7897 3.9330 3.9426 3.5283 4.0666 4.0162 4.0158 4.0222 4.0701 4.0121 3.9113 1.0138 1.0199 1.0111 1.0035 1.0122 1.0335 1.0270 0.9964 0.9929 1.0079 1.0203 1.0836 1.0073 1.0025 1.0096 1.0192 0.9995 1.0126 0.9989 1.0096 1.0097 1.0127 1.0144 0.9993
dispcorr: -0.027373226 hartree
energy: -1400.170154599297
dipole: -33.57879 32.97763 -0.60116 -31.57181 30.83744 -0.73437 8.42354 -7.53458 0.88896
magnitude: 1.30036 au
magnitude: 3.30526 debye
