program: Orca
programVersion: 4.2.1
elementType: Cl Cl Cl S N N N N C C C C C C C C C C C C C C C C C H H H H H H H H H H H H H
charge: 0
multiplicity: 1
keywords: wb97x-d3
keywords: def2-TZVPP
keywords: def2/J RIJCOSX GRIDX6 NOFINALGRIDX
keywords: grid4 nofinalgrid
keywords: scfconv7
keywords: smallprint printgap noloewdin
keywords: NOSOSCF
formula: C17H13Cl3N4S
InChI: InChI=1S/C17H13Cl3N4S/c18-13-3-1-12(2-4-13)9-25-17(8-24-11-21-10-22-24)23-16-6-5-14(19)7-15(16)20/h1-7,10-11H,8-9H2
38 atoms
Cl 1.647094 -1.720258 1.677726
Cl -8.126813 0.252825 0.285616
Cl 6.237967 -1.93947 -1.101289
S  -1.460066 1.399811 -0.306871
N  2.260614 1.98772 0.666188
N  0.62946 -0.165379 -0.606382
N  3.499124 2.082241 0.173265
N  3.549777 1.394853 2.308728
C  1.094874 2.250076 -0.136806
C  -2.226314 -0.194062 -0.731849
C  0.242595 1.016608 -0.375527
C  -3.699052 -0.079027 -0.483976
C  -4.218108 -0.323533 0.784082
C  -4.568046 0.287146 -1.506178
C  1.969507 -0.523019 -0.713886
C  -5.577817 -0.222931 1.029494
C  -5.932032 0.392942 -1.278108
C  2.307988 1.573657 1.9347
C  2.56624 -1.301666 0.277605
C  2.721871 -0.218782 -1.844959
C  -6.42418 0.134038 -0.009075
C  3.877963 -1.729977 0.175995
C  4.028275 -0.655221 -1.977061
C  4.598946 -1.400146 -0.95923
C  4.230769 1.708484 1.188307
H  1.426713 2.649838 -1.094592
H  0.500381 3.03082 0.339271
H  -1.774412 -0.963975 -0.108168
H  -2.009979 -0.426907 -1.773433
H  -3.557216 -0.605138 1.59445
H  -4.183765 0.48459 -2.499039
H  -5.968725 -0.423262 2.017473
H  -6.598182 0.670407 -2.083338
H  1.427542 1.437606 2.542911
H  2.272403 0.36366 -2.638553
H  4.323532 -2.314257 0.968887
H  4.592816 -0.406746 -2.864783
H  5.306726 1.675032 1.124202
elementType: Cl S N C H
totalener: -2653.53064384 hartree
nucrepener: 2637.50786480 hartree
electener: -5291.03850864 hartree
oneelecener: -8890.66101766 hartree
twoeener: 3599.62250901 hartree
cpcmener: -0.03185671 hartree
kineticenergy: 2647.22943435 hartree
xcener: -168.234973474134 hartree
chargesum: 0.0000000
charge: -0.086031 -0.099443 -0.098079 -0.057162 0.122555 -0.304748 -0.327687 -0.396712 -0.057925 -0.030851 0.151897 -0.002062 -0.196780 -0.181631 0.160057 -0.139356 -0.143171 0.034913 -0.030534 -0.217711 0.091920 -0.092017 -0.104582 0.061950 0.066863 0.154042 0.140965 0.119011 0.124104 0.143634 0.146584 0.147414 0.146516 0.176068 0.149606 0.124545 0.147035 0.156803
qa: -0.0860 -0.0994 -0.0981 -0.0572 0.1226 -0.3047 -0.3277 -0.3967 -0.0579 -0.0309 0.1519 -0.0021 -0.1968 -0.1816 0.1601 -0.1394 -0.1432 0.0349 -0.0305 -0.2177 0.0919 -0.0920 -0.1046 0.0620 0.0669 0.1540 0.1410 0.1190 0.1241 0.1436 0.1466 0.1474 0.1465 0.1761 0.1496 0.1245 0.1470 0.1568
va: 1.2345 1.2060 1.2037 2.4478 3.3468 2.9735 2.8643 3.0012 3.8650 3.8441 3.9903 3.6411 3.9867 3.9768 3.8217 3.9666 3.9664 4.0637 3.8695 4.0072 3.8281 3.9928 3.9598 3.8290 4.0359 1.0001 1.0059 1.0215 1.0136 1.0039 1.0030 1.0036 1.0041 0.9996 1.0006 1.0200 1.0007 0.9989
dispcorr: -0.022989038 hartree
energy: -2653.553632876853
dipole: -3.94353 2.76187 -1.18166 9.17312 -8.20969 0.96343 -5.25786 4.07273 -1.18513
magnitude: 1.93107 au
magnitude: 4.90840 debye
