program: Orca
programVersion: 4.2.1
elementType: Cl Cl Cl S N N N N C C C C C C C C C C C C C C C C C H H H H H H H H H H H H H
charge: 0
multiplicity: 1
keywords: wb97x-d3
keywords: def2-TZVPP
keywords: def2/J RIJCOSX GRIDX6 NOFINALGRIDX
keywords: grid4 nofinalgrid
keywords: scfconv7
keywords: smallprint printgap noloewdin
keywords: NOSOSCF
formula: C17H13Cl3N4S
InChI: InChI=1S/C17H13Cl3N4S/c18-13-3-1-12(2-4-13)9-25-17(8-24-11-21-10-22-24)23-16-6-5-14(19)7-15(16)20/h1-7,10-11H,8-9H2
38 atoms
Cl 1.4568 0.360502 3.187973
Cl -3.707067 -2.622597 -2.893812
Cl 3.199015 -3.746709 0.193448
S  -1.641337 3.13898 0.331984
N  2.150182 2.137095 -0.333722
N  -0.282047 0.963901 0.86187
N  2.769716 1.309649 -1.179799
N  4.005667 1.620001 0.666308
C  0.840555 2.662451 -0.60465
C  -2.941088 1.989642 0.881346
C  -0.254351 2.068683 0.256995
C  -3.144233 0.840951 -0.060114
C  -2.929623 -0.465168 0.364745
C  -3.543918 1.058215 -1.375652
C  0.608227 -0.080313 0.671955
C  -3.103132 -1.537262 -0.497858
C  -3.721521 -0.000229 -2.251934
C  2.895039 2.305889 0.762229
C  1.430568 -0.523893 1.706024
C  0.596383 -0.815964 -0.51284
C  -3.494771 -1.29274 -1.803025
C  2.239042 -1.638854 1.566008
C  1.384283 -1.940925 -0.668309
C  2.204362 -2.341853 0.373814
C  3.869292 1.023891 -0.535851
H  0.611945 2.490198 -1.655867
H  0.856495 3.74489 -0.462122
H  -3.832211 2.617214 0.939353
H  -2.714774 1.648381 1.889571
H  -2.614197 -0.65528 1.381823
H  -3.715841 2.066651 -1.731485
H  -2.925044 -2.546613 -0.153057
H  -4.033605 0.182546 -3.271057
H  2.601568 2.944484 1.580182
H  -0.053376 -0.501267 -1.319022
H  2.878907 -1.953122 2.37878
H  1.357895 -2.494053 -1.596797
H  4.614166 0.366589 -0.955316
elementType: Cl S N C H
totalener: -2653.52759291 hartree
nucrepener: 2809.44531772 hartree
electener: -5462.97291063 hartree
oneelecener: -9234.76550416 hartree
twoeener: 3771.79259353 hartree
cpcmener: -0.03051016 hartree
kineticenergy: 2647.24252478 hartree
xcener: -168.239997529333 hartree
chargesum: 0.0000000
charge: -0.088069 -0.104458 -0.098744 -0.080974 0.119679 -0.272828 -0.335845 -0.395336 -0.058807 -0.043388 0.132441 0.052453 -0.187491 -0.228380 0.230141 -0.138527 -0.125445 0.034514 -0.086342 -0.251217 0.083046 -0.057880 -0.096334 0.052268 0.070444 0.150149 0.147530 0.154083 0.119240 0.133621 0.138153 0.142314 0.145963 0.177282 0.139881 0.122467 0.145509 0.158887
qa: -0.0881 -0.1045 -0.0987 -0.0810 0.1197 -0.2728 -0.3358 -0.3953 -0.0588 -0.0434 0.1324 0.0525 -0.1875 -0.2284 0.2301 -0.1385 -0.1254 0.0345 -0.0863 -0.2512 0.0830 -0.0579 -0.0963 0.0523 0.0704 0.1501 0.1475 0.1541 0.1192 0.1336 0.1382 0.1423 0.1460 0.1773 0.1399 0.1225 0.1455 0.1589
va: 1.2363 1.2011 1.2039 2.3881 3.3626 2.9370 2.8701 3.0076 3.8537 3.8193 4.0165 3.5592 3.9133 4.0135 3.6322 3.9298 3.9598 4.0571 3.8924 3.9828 3.8160 3.9731 3.9637 3.8444 4.0296 1.0053 0.9985 0.9987 1.0329 1.0143 1.0116 1.0061 1.0033 0.9987 1.0058 1.0207 1.0023 0.9978
dispcorr: -0.026601725 hartree
energy: -2653.554194638371
dipole: -7.91788 6.11945 -1.79843 15.51192 -13.42202 2.08990 -3.54217 3.28922 -0.25295
magnitude: 2.76876 au
magnitude: 7.03763 debye
