program: Orca
programVersion: 4.2.1
elementType: Cl Cl Cl S N N N N C C C C C C C C C C C C C C C C C H H H H H H H H H H H H H
charge: 0
multiplicity: 1
keywords: wb97x-d3
keywords: def2-TZVPP
keywords: def2/J RIJCOSX GRIDX6 NOFINALGRIDX
keywords: grid4 nofinalgrid
keywords: scfconv7
keywords: smallprint printgap noloewdin
keywords: NOSOSCF
formula: C17H13Cl3N4S
InChI: InChI=1S/C17H13Cl3N4S/c18-13-3-1-12(2-4-13)9-25-17(8-24-11-21-10-22-24)23-16-6-5-14(19)7-15(16)20/h1-7,10-11H,8-9H2
38 atoms
Cl 1.949611 -0.910962 3.15709
Cl -3.793121 -1.078391 -3.630944
Cl 2.598535 -5.084489 -0.154418
S  -0.585178 2.584327 1.314329
N  2.00884 2.749448 0.023552
N  -0.082904 0.017387 1.115966
N  1.665199 2.905908 -1.257024
N  2.22232 4.878427 -0.338957
C  1.854964 1.487882 0.690674
C  -2.235163 1.831722 1.394141
C  0.412503 1.175336 1.023633
C  -2.629331 1.119779 0.13282
C  -3.093224 -0.189315 0.189654
C  -2.542399 1.743372 -1.107331
C  0.615828 -1.144156 0.816988
C  -3.461632 -0.871024 -0.959948
C  -2.90067 1.076146 -2.268356
C  2.323532 3.931428 0.557806
C  1.54927 -1.716853 1.681011
C  0.306077 -1.834932 -0.35511
C  -3.355063 -0.230764 -2.183447
C  2.162085 -2.926325 1.393227
C  0.913757 -3.036626 -0.666668
C  1.839261 -3.574807 0.214518
C  1.816382 4.192244 -1.424593
H  2.434077 1.520294 1.61452
H  2.277299 0.698975 0.068825
H  -2.893449 2.681167 1.588682
H  -2.294718 1.172098 2.258251
H  -3.159127 -0.696808 1.143163
H  -2.176257 2.759698 -1.181371
H  -3.812715 -1.891899 -0.897434
H  -2.821569 1.571772 -3.22628
H  2.627081 4.046312 1.586588
H  -0.429807 -1.4133 -1.027245
H  2.88164 -3.348496 2.080694
H  0.660978 -3.547303 -1.585298
H  1.629932 4.660931 -2.377757
elementType: Cl S N C H
totalener: -2653.53021902 hartree
nucrepener: 2725.13015434 hartree
electener: -5378.66037336 hartree
oneelecener: -9065.70931119 hartree
twoeener: 3687.04893784 hartree
cpcmener: -0.02920480 hartree
kineticenergy: 2647.25348094 hartree
xcener: -168.238968878315 hartree
chargesum: -0.0000000
charge: -0.082017 -0.106647 -0.092325 -0.080466 0.063345 -0.276883 -0.335281 -0.407551 -0.055486 -0.042344 0.163578 0.107593 -0.218716 -0.227440 0.124203 -0.151053 -0.126068 0.067189 -0.016478 -0.183074 0.088092 -0.093614 -0.136397 0.075078 0.067153 0.142809 0.148947 0.151867 0.114924 0.130593 0.130754 0.144882 0.146286 0.188495 0.140495 0.126607 0.145316 0.163633
qa: -0.0820 -0.1066 -0.0923 -0.0805 0.0633 -0.2769 -0.3353 -0.4076 -0.0555 -0.0423 0.1636 0.1076 -0.2187 -0.2274 0.1242 -0.1511 -0.1261 0.0672 -0.0165 -0.1831 0.0881 -0.0936 -0.1364 0.0751 0.0672 0.1428 0.1489 0.1519 0.1149 0.1306 0.1308 0.1449 0.1463 0.1885 0.1405 0.1266 0.1453 0.1636
va: 1.2446 1.1968 1.2099 2.4014 3.4160 2.9932 2.8750 3.0232 3.8463 3.8372 3.9423 3.5235 3.9464 4.0079 3.7733 3.9366 3.9620 4.0443 3.9641 3.9928 3.8012 4.0163 4.0201 3.8366 4.0510 0.9995 1.0007 0.9985 1.0328 1.0110 1.0177 1.0048 1.0031 0.9882 1.0045 1.0175 1.0052 0.9946
dispcorr: -0.022986623 hartree
energy: -2653.553205642663
dipole: -5.86922 5.80671 -0.06251 17.17275 -17.13848 0.03427 0.78470 0.56070 1.34540
magnitude: 1.34729 au
magnitude: 3.42454 debye
