program: Orca
programVersion: 4.2.1
elementType: Cl Cl Cl S N N N N C C C C C C C C C C C C C C C C C H H H H H H H H H H H H H
charge: 0
multiplicity: 1
keywords: wb97x-d3
keywords: def2-TZVPP
keywords: def2/J RIJCOSX GRIDX6 NOFINALGRIDX
keywords: grid4 nofinalgrid
keywords: scfconv7
keywords: smallprint printgap noloewdin
keywords: NOSOSCF
formula: C17H13Cl3N4S
InChI: InChI=1S/C17H13Cl3N4S/c18-13-3-1-12(2-4-13)9-25-17(8-24-11-21-10-22-24)23-16-6-5-14(19)7-15(16)20/h1-7,10-11H,8-9H2
38 atoms
Cl 1.427353 -1.794399 1.806469
Cl -8.195167 0.170482 -0.157986
Cl 6.074914 -2.287789 -0.829541
S  -1.510187 1.207327 0.373506
N  2.311943 1.961504 0.859145
N  0.61846 -0.053269 -0.500004
N  3.393728 1.415188 1.421618
N  3.97457 2.701248 -0.324309
C  0.977909 1.653909 1.300528
C  -2.221351 -0.076555 -0.69903
C  0.192596 0.827568 0.303125
C  -3.711469 -0.015144 -0.567156
C  -4.462307 0.816091 -1.39178
C  -4.365934 -0.777029 0.395481
C  1.927687 -0.52173 -0.526564
C  -5.842125 0.880532 -1.271843
C  -5.744689 -0.726932 0.527363
C  2.674011 2.718974 -0.177843
C  2.418939 -1.389662 0.449399
C  2.752939 -0.232699 -1.61143
C  -6.470869 0.104319 -0.311256
C  3.685084 -1.942884 0.362946
C  4.029004 -0.756235 -1.706049
C  4.484674 -1.611205 -0.715551
C  4.358424 1.884766 0.676733
H  0.448943 2.584419 1.510632
H  1.046744 1.11178 2.24372
H  -1.830018 -1.04266 -0.382447
H  -1.901876 0.102023 -1.724478
H  -3.970364 1.419238 -2.144811
H  -3.797921 -1.426841 1.049585
H  -6.414455 1.526674 -1.922898
H  -6.241473 -1.331126 1.273947
H  1.96525 3.259662 -0.785788
H  2.385525 0.423089 -2.38937
H  4.038886 -2.612872 1.133854
H  4.653522 -0.501626 -2.550944
H  5.38908 1.632465 0.869333
elementType: Cl S N C H
totalener: -2653.53084376 hartree
nucrepener: 2634.71573050 hartree
electener: -5288.24657426 hartree
oneelecener: -8885.00689294 hartree
twoeener: 3596.76031868 hartree
cpcmener: -0.03076081 hartree
kineticenergy: 2647.23713114 hartree
xcener: -168.236604716566 hartree
chargesum: -0.0000000
charge: -0.084711 -0.099742 -0.098034 -0.055909 0.121345 -0.297436 -0.332872 -0.401675 -0.071583 -0.023226 0.137850 -0.002146 -0.184026 -0.188893 0.170854 -0.146655 -0.143584 0.056279 -0.008112 -0.234174 0.094653 -0.118020 -0.104280 0.070661 0.072214 0.147005 0.149357 0.114275 0.121836 0.147239 0.142939 0.146392 0.147445 0.178802 0.146661 0.125892 0.144897 0.158482
qa: -0.0847 -0.0997 -0.0980 -0.0559 0.1213 -0.2974 -0.3329 -0.4017 -0.0716 -0.0232 0.1379 -0.0021 -0.1840 -0.1889 0.1709 -0.1467 -0.1436 0.0563 -0.0081 -0.2342 0.0947 -0.1180 -0.1043 0.0707 0.0722 0.1470 0.1494 0.1143 0.1218 0.1472 0.1429 0.1464 0.1474 0.1788 0.1467 0.1259 0.1449 0.1585
va: 1.2418 1.2055 1.2041 2.4529 3.3432 2.9691 2.8625 3.0079 3.8657 3.8392 3.9868 3.6391 3.9778 3.9848 3.7970 3.9714 3.9674 4.0634 3.9374 3.9461 3.8262 4.0369 3.9436 3.8303 4.0268 1.0068 1.0120 1.0195 1.0158 1.0028 1.0037 1.0043 1.0038 0.9927 1.0111 1.0180 1.0026 0.9974
dispcorr: -0.022834909 hartree
energy: -2653.553678673043
dipole: -2.99860 1.81946 -1.17914 10.08187 -9.33663 0.74524 -4.64484 4.36268 -0.28217
magnitude: 1.42315 au
magnitude: 3.61737 debye
