program: Orca
programVersion: 4.2.1
elementType: Cl Cl Cl S N N N N C C C C C C C C C C C C C C C C C H H H H H H H H H H H H H
charge: 0
multiplicity: 1
keywords: wb97x-d3
keywords: def2-TZVPP
keywords: def2/J RIJCOSX GRIDX6 NOFINALGRIDX
keywords: grid4 nofinalgrid
keywords: scfconv7
keywords: smallprint printgap noloewdin
keywords: NOSOSCF
formula: C17H13Cl3N4S
InChI: InChI=1S/C17H13Cl3N4S/c18-13-3-1-12(2-4-13)9-25-17(8-24-11-21-10-22-24)23-16-6-5-14(19)7-15(16)20/h1-7,10-11H,8-9H2
38 atoms
Cl 2.442578 1.483323 -2.371156
Cl -4.670366 -2.708525 1.791031
Cl 3.999265 -3.391467 -0.748478
S  -1.533168 3.024189 -0.51798
N  1.683707 1.780188 1.350331
N  -0.080387 0.866708 -0.824155
N  1.099267 1.056215 2.308118
N  3.275567 0.533987 2.13729
C  0.925511 2.699289 0.551565
C  -2.638925 1.925713 -1.452513
C  -0.124064 2.009152 -0.295933
C  -3.140983 0.76831 -0.642174
C  -2.846098 -0.539085 -1.011114
C  -3.922715 0.982538 0.489588
C  0.940915 -0.064845 -0.741569
C  -3.315838 -1.61505 -0.27184
C  -4.397208 -0.078987 1.242525
C  2.974046 1.450682 1.253867
C  2.127673 0.0414 -1.468437
C  0.73003 -1.238898 -0.017418
C  -4.085626 -1.3733 0.853454
C  3.071725 -0.972047 -1.479781
C  1.665812 -2.25513 -0.002187
C  2.830099 -2.116707 -0.74141
C  2.090366 0.32417 2.744074
H  1.611179 3.24317 -0.099652
H  0.457892 3.436944 1.204434
H  -2.134385 1.598614 -2.359919
H  -3.46025 2.57924 -1.751792
H  -2.237246 -0.728798 -1.884698
H  -4.165416 1.992316 0.797419
H  -3.076149 -2.626332 -0.570877
H  -5.002668 0.102211 2.120009
H  3.64924 1.915003 0.552188
H  -0.191759 -1.348004 0.53768
H  3.982412 -0.861488 -2.051795
H  1.48002 -3.150006 0.575182
H  1.958082 -0.386972 3.543914
elementType: Cl S N C H
totalener: -2653.52953630 hartree
nucrepener: 2784.12307435 hartree
electener: -5437.65261065 hartree
oneelecener: -9184.30819718 hartree
twoeener: 3746.65558653 hartree
cpcmener: -0.02933277 hartree
kineticenergy: 2647.23526011 hartree
xcener: -168.239740328843 hartree
chargesum: -0.0000000
charge: -0.083195 -0.104280 -0.096111 -0.077789 0.118765 -0.278294 -0.338992 -0.391991 -0.120411 -0.045576 0.180939 0.079337 -0.208593 -0.222424 0.221057 -0.145464 -0.134857 0.073315 -0.070485 -0.251128 0.086336 -0.076964 -0.108719 0.062778 0.059379 0.154266 0.137190 0.118610 0.155891 0.134665 0.137210 0.145603 0.145386 0.169697 0.142207 0.124903 0.145770 0.161969
qa: -0.0832 -0.1043 -0.0961 -0.0778 0.1188 -0.2783 -0.3390 -0.3920 -0.1204 -0.0456 0.1809 0.0793 -0.2086 -0.2224 0.2211 -0.1455 -0.1349 0.0733 -0.0705 -0.2511 0.0863 -0.0770 -0.1087 0.0628 0.0594 0.1543 0.1372 0.1186 0.1559 0.1347 0.1372 0.1456 0.1454 0.1697 0.1422 0.1249 0.1458 0.1620
va: 1.2450 1.2017 1.2077 2.3931 3.3440 3.0105 2.8563 3.0215 3.9126 3.8132 3.9404 3.5284 3.9439 4.0175 3.6668 3.9296 3.9634 4.0576 3.9501 3.9663 3.8223 3.9917 3.9721 3.8498 4.0576 0.9959 1.0138 1.0318 0.9983 1.0118 1.0114 1.0040 1.0038 0.9977 1.0117 1.0187 1.0027 0.9964
dispcorr: -0.025599867 hartree
energy: -2653.555136170776
dipole: -9.08265 8.39538 -0.68727 11.58520 -9.54843 2.03677 2.50571 -3.50684 -1.00113
magnitude: 2.37129 au
magnitude: 6.02735 debye
