program: Orca
programVersion: 4.2.1
elementType: Cl Cl Cl S N N N N C C C C C C C C C C C C C C C C C H H H H H H H H H H H H H
charge: 0
multiplicity: 1
keywords: wb97x-d3
keywords: def2-TZVPP
keywords: def2/J RIJCOSX GRIDX6 NOFINALGRIDX
keywords: grid4 nofinalgrid
keywords: scfconv7
keywords: smallprint printgap noloewdin
keywords: NOSOSCF
formula: C17H13Cl3N4S
InChI: InChI=1S/C17H13Cl3N4S/c18-13-3-1-12(2-4-13)9-25-17(8-24-11-21-10-22-24)23-16-6-5-14(19)7-15(16)20/h1-7,10-11H,8-9H2
38 atoms
Cl -0.363717 -1.312616 1.093053
Cl -4.762863 -2.154689 1.066346
Cl 2.971978 -4.792563 -1.264343
S  -0.224417 2.922636 -0.226794
N  2.312341 2.689947 1.137192
N  0.453285 0.544131 -1.111931
N  1.909269 3.289536 2.262185
N  3.241712 4.651097 1.073679
C  1.836228 1.390796 0.745317
C  -1.650393 2.438928 -1.243683
C  0.729165 1.457487 -0.282701
C  -2.430766 1.296541 -0.664159
C  -2.652223 0.145311 -1.41003
C  -2.952634 1.367676 0.623459
C  1.091855 -0.689668 -1.099456
C  -3.376673 -0.916678 -0.890881
C  -3.673572 0.314396 1.161801
C  3.095071 3.516205 0.439867
C  0.775336 -1.668859 -0.153882
C  2.000354 -1.022505 -2.102794
C  -3.875201 -0.823247 0.396612
C  1.347259 -2.930431 -0.197866
C  2.588032 -2.273423 -2.157356
C  2.254549 -3.220553 -1.202087
C  2.495226 4.453741 2.177142
H  1.468984 0.884841 1.638533
H  2.670938 0.806971 0.357269
H  -1.317163 2.224719 -2.257699
H  -2.254069 3.347726 -1.285918
H  -2.250902 0.065556 -2.411544
H  -2.791194 2.251988 1.227528
H  -3.53538 -1.807261 -1.483408
H  -4.070627 0.383346 2.16522
H  3.53492 3.246525 -0.507594
H  2.246225 -0.283725 -2.853659
H  1.086663 -3.671014 0.545502
H  3.295311 -2.50273 -2.942089
H  2.382767 5.19557 2.951745
elementType: Cl S N C H
totalener: -2653.52993027 hartree
nucrepener: 2755.48285456 hartree
electener: -5409.01278483 hartree
oneelecener: -9126.50831179 hartree
twoeener: 3717.49552696 hartree
cpcmener: -0.03129959 hartree
kineticenergy: 2647.25821099 hartree
xcener: -168.240636917843 hartree
chargesum: 0.0000000
charge: -0.083471 -0.108882 -0.093096 -0.081530 0.063519 -0.285398 -0.343283 -0.406418 -0.042538 -0.031202 0.139684 0.092356 -0.209917 -0.234273 0.156192 -0.130959 -0.130450 0.078371 -0.018690 -0.244842 0.077652 -0.088313 -0.092396 0.059182 0.073905 0.134001 0.158273 0.117544 0.152918 0.130967 0.132372 0.142705 0.144705 0.183998 0.146322 0.128618 0.147722 0.164651
qa: -0.0835 -0.1089 -0.0931 -0.0815 0.0635 -0.2854 -0.3433 -0.4064 -0.0425 -0.0312 0.1397 0.0924 -0.2099 -0.2343 0.1562 -0.1310 -0.1305 0.0784 -0.0187 -0.2448 0.0777 -0.0883 -0.0924 0.0592 0.0739 0.1340 0.1583 0.1175 0.1529 0.1310 0.1324 0.1427 0.1447 0.1840 0.1463 0.1286 0.1477 0.1647
va: 1.2446 1.1949 1.2102 2.3991 3.3800 2.9677 2.8589 3.0253 3.8566 3.8214 3.9687 3.5023 3.9545 4.0270 3.6888 3.9369 3.9468 4.0506 3.9811 4.0298 3.8048 4.0083 3.9506 3.8604 4.0357 1.0137 0.9905 1.0329 0.9989 1.0133 1.0147 1.0036 1.0039 0.9895 1.0115 1.0182 1.0019 0.9937
dispcorr: -0.023710345 hartree
energy: -2653.553640613408
dipole: 3.40008 -2.82203 0.57806 20.54574 -20.39708 0.14866 -5.65788 4.17039 -1.48749
magnitude: 1.60277 au
magnitude: 4.07392 debye
