program: Orca
programVersion: 4.2.1
elementType: Cl Cl Cl S N N N N C C C C C C C C C C C C C C C C C H H H H H H H H H H H H H
charge: 0
multiplicity: 1
keywords: wb97x-d3
keywords: def2-TZVPP
keywords: def2/J RIJCOSX GRIDX6 NOFINALGRIDX
keywords: grid4 nofinalgrid
keywords: scfconv7
keywords: smallprint printgap noloewdin
keywords: NOSOSCF
formula: C17H13Cl3N4S
InChI: InChI=1S/C17H13Cl3N4S/c18-13-3-1-12(2-4-13)9-25-17(8-24-11-21-10-22-24)23-16-6-5-14(19)7-15(16)20/h1-7,10-11H,8-9H2
38 atoms
Cl -0.491894 -1.236694 1.239531
Cl -4.800883 -2.333857 0.593035
Cl 3.009982 -4.682819 -0.921813
S  -0.400072 2.974143 -0.068542
N  2.331584 2.699874 1.183103
N  0.457039 0.636704 -0.906236
N  3.238405 2.944562 0.234191
N  3.069831 4.688435 1.638728
C  1.541058 1.497016 1.152041
C  -1.69321 2.471075 -1.244311
C  0.589057 1.528311 -0.022009
C  -2.477578 1.278523 -0.784578
C  -3.170675 1.298457 0.421386
C  -2.524105 0.126173 -1.560106
C  1.100703 -0.59099 -0.848535
C  -3.889851 0.194673 0.850342
C  -3.242349 -0.98642 -1.150035
C  2.232753 3.748623 2.000265
C  0.725942 -1.579464 0.065198
C  2.079064 -0.909469 -1.788882
C  -3.914814 -0.942573 0.058528
C  1.30491 -2.839036 0.047815
C  2.677158 -2.155743 -1.813135
C  2.2811 -3.114385 -0.893367
C  3.6504 4.142097 0.554986
H  0.981577 1.429237 2.084667
H  2.206276 0.636578 1.0954
H  -1.246583 2.30519 -2.223134
H  -2.327223 3.356639 -1.322147
H  -3.148977 2.181894 1.04759
H  -1.98829 0.087556 -2.499104
H  -4.422492 0.224516 1.790956
H  -3.263024 -1.876087 -1.764332
H  1.55664 3.775645 2.840293
H  2.372205 -0.162309 -2.513951
H  0.996516 -3.588477 0.763376
H  3.439426 -2.372674 -2.548207
H  4.415228 4.64291 -0.017087
elementType: Cl S N C H
totalener: -2653.53080035 hartree
nucrepener: 2759.34357969 hartree
electener: -5412.87438004 hartree
oneelecener: -9134.35227509 hartree
twoeener: 3721.47789506 hartree
cpcmener: -0.03028130 hartree
kineticenergy: 2647.26291659 hartree
xcener: -168.240303112737 hartree
chargesum: 0.0000000
charge: -0.081389 -0.108092 -0.093017 -0.091173 0.078807 -0.258295 -0.348344 -0.413067 -0.061673 -0.039999 0.133645 0.093279 -0.236077 -0.208228 0.181547 -0.129029 -0.131663 0.082936 -0.033228 -0.253183 0.078485 -0.077243 -0.093638 0.059157 0.072550 0.137516 0.146808 0.118688 0.153643 0.132691 0.131707 0.144160 0.142979 0.184951 0.143548 0.128600 0.147775 0.163865
qa: -0.0814 -0.1081 -0.0930 -0.0912 0.0788 -0.2583 -0.3483 -0.4131 -0.0617 -0.0400 0.1336 0.0933 -0.2361 -0.2082 0.1815 -0.1290 -0.1317 0.0829 -0.0332 -0.2532 0.0785 -0.0772 -0.0936 0.0592 0.0725 0.1375 0.1468 0.1187 0.1536 0.1327 0.1317 0.1442 0.1430 0.1850 0.1435 0.1286 0.1478 0.1639
va: 1.2464 1.1959 1.2104 2.3903 3.3927 2.9484 2.8658 3.0255 3.8832 3.8328 3.9586 3.4961 4.0281 3.9478 3.6471 3.9472 3.9358 4.0344 3.9863 4.0531 3.8059 3.9884 3.9568 3.8618 4.0473 1.0068 1.0023 1.0307 0.9985 1.0148 1.0139 1.0038 1.0036 0.9897 1.0138 1.0182 1.0020 0.9944
dispcorr: -0.023883449 hartree
energy: -2653.554683801422
dipole: 2.71484 -3.13786 -0.42302 20.93256 -20.54454 0.38802 -4.22092 4.21773 -0.00319
magnitude: 0.57403 au
magnitude: 1.45908 debye
