program: Gaussian 09
title: 000030380
version: EM64L-G09RevD.01
frameworkgroup: C1[X(C13H17NO)]
method: RPBEPBE
basis: SDD
operation: Freq
keyword: #p
keyword: freq=noraman
keyword: PBEPBE/SDD
title: #p freq=noraman PBEPBE/SDD
converged: YES YES NO NO
title: Mulliken charges:
elementType: O N C C C C C C C C C C C C C H H H H H H H H H H H H H H H H H
charge: -0.282421 -0.353386 0.439194 -0.494224 -0.573733 -0.417890 -0.443061 -0.659495 0.500681 -0.085117 -0.405560 -0.398069 -0.236805 -0.244026 -0.245205 0.202388 0.273875 0.243848 0.213111 0.207853 0.229925 0.219840 0.216003 0.263049 0.205040 0.304821 0.167162 0.252510 0.222818 0.225815 0.223577 0.227483
chargesum: 0.00000
title: Mulliken charges with hydrogens summed into heavy atoms:
elementType: O N C C C C C C C C C C C C C
charge: -0.282421 -0.048565 0.439194 -0.017961 -0.116774 0.019887 -0.007217 -0.191406 0.500681 0.082045 -0.153050 -0.175252 -0.010990 -0.020449 -0.017722
polarizability: 1.64927129e+02 3.91047851e-01 1.48295835e+02 1.70010254e+01 -1.55865099e+00 1.06374239e+02
1716.lowfreq: -12.0283 -8.8760 -0.0006 -0.0005 0.0006 5.4445 29.9787 58.3407 63.0409
frequency: 29.8865 58.1266 63.0244 70.6772 82.1237 145.0540 171.6879 203.5898 222.0396 259.5833 327.1676 360.6917 396.7815 408.5332 425.0268 475.3787 562.6040 569.2812 617.5041 628.8128 649.5641 682.3085 711.0901 761.8268 786.8956 799.5633 817.5565 825.5850 860.9450 876.2851 891.8628 918.7994 931.8523 961.5206 965.0349 981.2857 990.1330 996.8063 1004.9192 1026.9233 1034.2703 1045.6074 1075.7905 1092.6330 1119.0674 1167.0029 1171.7890 1181.4396 1189.7329 1195.6398 1214.6383 1219.8232 1227.2491 1260.3345 1280.3624 1298.3312 1307.4672 1316.5061 1328.6655 1334.6800 1370.1879 1382.0627 1439.4627 1451.9102 1467.8619 1473.1619 1476.8218 1478.8123 1483.9555 1493.1482 1590.8046 1613.4758 1632.2314 2910.2576 2993.8674 2995.1575 2999.9555 3002.9392 3017.7870 3045.3842 3060.0145 3063.6934 3077.0485 3093.7821 3112.6768 3120.9444 3133.1249 3143.2196 3161.0301 3522.0743
redmass: 4.5700 1.8783 4.7675 3.9521 3.7682 2.7665 4.0348 4.0154 2.6080 4.5013 3.0649 2.6045 2.0548 2.8216 2.8810 3.5897 1.1575 5.1293 6.1304 3.2105 3.0427 2.2865 1.7241 2.0049 1.6293 2.2237 2.3616 3.5224 1.2536 2.9009 2.1137 1.7535 1.5597 1.6229 2.1221 1.3709 6.0009 1.3481 1.5851 2.2794 1.6654 3.0282 1.7360 1.9988 2.1494 1.3399 1.0857 1.3973 1.1284 1.4663 1.7682 1.9272 1.6760 1.5150 1.3169 1.3413 1.3682 1.5888 1.3810 1.3514 1.2373 6.9212 2.1309 1.3952 1.1039 1.1228 1.2418 1.1320 2.1500 1.1052 5.9318 6.0811 5.3012 1.0854 1.0601 1.0623 1.0644 1.0614 1.0654 1.1006 1.1026 1.1023 1.1020 1.1003 1.0866 1.0862 1.0916 1.0961 1.1015 1.0779
irintensity: 0.9272 1.2857 5.0034 1.5919 4.3730 5.2444 10.0443 5.3696 17.7030 3.0664 11.8490 0.3814 7.9505 0.2188 11.8441 3.9212 82.6356 5.3157 0.1731 4.9932 17.3554 8.9300 58.8798 26.3331 4.4844 1.1020 2.9800 3.6716 0.1318 0.3380 4.6539 0.6240 3.2359 0.1523 4.1509 0.3311 0.0061 0.4061 2.6527 6.4631 1.4384 3.6985 8.9183 4.9495 4.7498 2.1128 0.2743 5.0462 0.6222 6.5890 10.7859 4.0276 28.5295 1.7332 0.4486 4.8442 1.9584 15.4470 6.6268 2.2161 17.3607 0.1609 2.5528 104.9046 7.4974 12.2692 38.7571 34.0646 20.7941 3.2165 2.3222 8.8115 203.6784 113.2404 8.5650 11.4670 61.8132 47.9109 39.8738 12.0912 3.7193 4.1708 62.0909 30.3509 11.3176 0.2868 15.8857 39.4871 24.2216 12.4505
temp: 298.150 k
press: 1.00000 atm
elementType: 8 7 6 6 6 6 6 6 6 6 6 6 6 6 6 1 1 1 1 1 1 1 1 1 1 1 1 1 1 1 1 1
symmnumber: 1
zpe: 714088.1 jmol-1
zpe.correction: 0.271982 hartree
zpe.thermalcorrener: 0.285955 hartree
zpe.thermalcorrenthalpy: 0.286899 hartree
zpe.thermalcorrgfe: 0.230021 hartree
zpe.sumelectzpe: -634.445949 hartree
zpe.sumelectthermal: -634.431976 hartree
zpe.sumelectthermalent: -634.431032 hartree
zpe.sumelectthermalfe: -634.487909 hartree
dipole: 0.0460 -3.3512 -2.3397
dipole: 4.0874
quadrupole: -87.8092 -95.2586 -87.3042
quadrupole: -5.3699 1.1124 -6.5176
quadrupole: 2.3148 -5.1346 2.8198 -5.3699 1.1124 -6.5176
hfenergy: -634.7179308 hartree
pointgroup: C01 [X(C13H17N1O1)]
dipole: 0.020204 1.3395949 -0.889411 debye
polarizability: 165.129643|0.3505768|148.1713975|-16.6146825|2.9621179|106.2961621 unknown
InChI: InChI=1S/C13H17NO/c15-11-14-13(8-4-5-9-13)10-12-6-2-1-3-7-12/h1-3,6-7,11,14H,4-5,8-10H2
charge 0 multiplicity 1
32 atoms
O  -1.431831 -2.759799 0.245266
N  -1.165158 -0.734318 -0.918767
C  -1.252244 0.222915 0.224287
C  -2.651117 0.112362 0.90355
C  -1.303094 1.656483 -0.373263
C  -3.632634 0.833197 -0.062562
C  -2.759547 1.837014 -0.893172
C  -0.086269 -0.014438 1.241423
C  1.309266 0.076013 0.643524
C  -1.247008 -2.104122 -0.822476
C  1.965536 -1.089555 0.166365
C  1.988082 1.319099 0.538563
C  3.253252 -1.01346 -0.411458
C  3.275852 1.400438 -0.037583
C  3.912701 0.232992 -0.51937
H  -2.601315 0.641381 1.874986
H  -2.921402 -0.936374 1.105787
H  -0.532425 1.827955 -1.147364
H  -1.100916 2.371215 0.445759
H  -4.43694 1.346933 0.493094
H  -4.119321 0.102246 -0.732359
H  -2.827142 1.606184 -1.972376
H  -3.097254 2.881382 -0.771431
H  -0.243287 -1.011491 1.691078
H  -0.209056 0.737318 2.044587
H  -0.947531 -0.344424 -1.839363
H  -1.127063 -2.600717 -1.814961
H  1.466568 -2.061113 0.265359
H  1.508308 2.228679 0.922081
H  3.745082 -1.925879 -0.767953
H  3.784826 2.369067 -0.102898
H  4.913379 0.292618 -0.962152
