program: Orca
programVersion: 4.2.1
elementType: Cl Cl Cl S N N N N C C C C C C C C C C C C C C C C C H H H H H H H H H H H H H
charge: 0
multiplicity: 1
keywords: wb97x-d3
keywords: def2-TZVPP
keywords: def2/J RIJCOSX GRIDX6 NOFINALGRIDX
keywords: grid4 nofinalgrid
keywords: scfconv7
keywords: smallprint printgap noloewdin
keywords: NOSOSCF
formula: C17H13Cl3N4S
InChI: InChI=1S/C17H13Cl3N4S/c18-13-3-1-12(2-4-13)9-25-17(8-24-11-21-10-22-24)23-16-6-5-14(19)7-15(16)20/h1-7,10-11H,8-9H2
38 atoms
Cl -0.297658 -1.362391 0.997499
Cl -4.679337 -2.28723 1.082376
Cl 3.070624 -4.692582 -1.524313
S  -0.27677 2.916326 -0.181013
N  2.203708 2.691289 1.243843
N  0.457807 0.58842 -1.150331
N  2.91852 3.561402 0.523901
N  2.287063 4.476643 2.475469
C  1.834021 1.405388 0.722614
C  -1.704491 2.416978 -1.186168
C  0.718396 1.481839 -0.295396
C  -2.448714 1.245732 -0.616654
C  -2.944902 1.277736 0.682605
C  -2.662209 0.106816 -1.383536
C  1.123818 -0.630082 -1.184869
C  -3.633252 0.198197 1.211446
C  -3.354998 -0.98083 -0.87393
C  1.827977 3.254931 2.393683
C  0.836907 -1.649027 -0.272495
C  2.027248 -0.910001 -2.208869
C  -3.829303 -0.926082 0.424902
C  1.429643 -2.898045 -0.369075
C  2.635429 -2.147555 -2.316578
C  2.328993 -3.135041 -1.393817
C  2.941194 4.607245 1.305484
H  1.507581 0.784828 1.558822
H  2.7112 0.929726 0.285098
H  -1.378228 2.22766 -2.207359
H  -2.330397 3.311393 -1.206445
H  -2.788474 2.151786 1.30283
H  -2.280144 0.058006 -2.39461
H  -4.010418 0.236982 2.224139
H  -3.50756 -1.861699 -1.4823
H  1.235382 2.737894 3.131931
H  2.251504 -0.140571 -2.935262
H  1.189671 -3.66973 0.349149
H  3.336673 -2.335011 -3.117639
H  3.46035 5.509114 1.02246
elementType: Cl S N C H
totalener: -2653.53117125 hartree
nucrepener: 2757.36376617 hartree
electener: -5410.89493742 hartree
oneelecener: -9130.17341054 hartree
twoeener: 3719.27847312 hartree
cpcmener: -0.03021747 hartree
kineticenergy: 2647.26156704 hartree
xcener: -168.242109462067 hartree
chargesum: -0.0000000
charge: -0.085305 -0.108418 -0.093602 -0.081409 0.061418 -0.286164 -0.342633 -0.406525 -0.044418 -0.026771 0.147459 0.085771 -0.233158 -0.208857 0.165536 -0.130246 -0.130457 0.082027 -0.022430 -0.242089 0.077205 -0.091994 -0.094203 0.060599 0.071548 0.139291 0.149710 0.117609 0.152557 0.133537 0.130956 0.144466 0.142617 0.179979 0.146054 0.128412 0.147538 0.164391
qa: -0.0853 -0.1084 -0.0936 -0.0814 0.0614 -0.2862 -0.3426 -0.4065 -0.0444 -0.0268 0.1475 0.0858 -0.2332 -0.2089 0.1655 -0.1302 -0.1305 0.0820 -0.0224 -0.2421 0.0772 -0.0920 -0.0942 0.0606 0.0715 0.1393 0.1497 0.1176 0.1526 0.1335 0.1310 0.1445 0.1426 0.1800 0.1461 0.1284 0.1475 0.1644
va: 1.2417 1.1956 1.2094 2.4001 3.3877 2.9644 2.8571 3.0256 3.8558 3.8166 3.9543 3.5137 4.0279 3.9521 3.6819 3.9471 3.9366 4.0516 3.9775 4.0257 3.8043 4.0123 3.9529 3.8583 4.0484 1.0021 1.0021 1.0329 0.9991 1.0142 1.0130 1.0041 1.0035 0.9912 1.0116 1.0181 1.0018 0.9942
dispcorr: -0.023683635 hartree
energy: -2653.554854885687
dipole: 2.07216 -2.04896 0.02320 20.52176 -20.45938 0.06238 -3.76661 3.20242 -0.56419
magnitude: 0.56810 au
magnitude: 1.44400 debye
