program: Orca
programVersion: 4.2.1
elementType: Cl Cl Cl S N N N N C C C C C C C C C C C C C C C C C H H H H H H H H H H H H H
charge: 0
multiplicity: 1
keywords: wb97x-d3
keywords: def2-TZVPP
keywords: def2/J RIJCOSX GRIDX6 NOFINALGRIDX
keywords: grid4 nofinalgrid
keywords: scfconv7
keywords: smallprint printgap noloewdin
keywords: NOSOSCF
formula: C17H13Cl3N4S
InChI: InChI=1S/C17H13Cl3N4S/c18-13-3-1-12(2-4-13)9-25-17(8-24-11-21-10-22-24)23-16-6-5-14(19)7-15(16)20/h1-7,10-11H,8-9H2
38 atoms
Cl 2.032026 0.67711 -2.50172
Cl -8.221362 -0.079756 0.491635
Cl 6.112525 -2.29662 -0.669479
S  -1.523611 0.929705 0.858134
N  2.292503 1.739082 1.242453
N  0.587995 -0.292141 -0.115055
N  3.416627 1.232504 1.758486
N  3.88407 2.617479 0.056494
C  0.991096 1.361065 1.726045
C  -2.267177 -0.319681 -0.238124
C  0.178975 0.561757 0.723437
C  -3.753187 -0.260385 -0.062718
C  -4.538156 0.52205 -0.90284
C  -4.369273 -0.976941 0.959195
C  1.909604 -0.716811 -0.199625
C  -5.913943 0.583278 -0.739607
C  -5.74246 -0.927615 1.136322
C  2.587915 2.556331 0.227742
C  2.691216 -0.375399 -1.30295
C  2.456391 -1.584274 0.742696
C  -6.50337 -0.144835 0.281379
C  3.985687 -0.84259 -1.450638
C  3.740106 -2.080027 0.603608
C  4.498699 -1.697216 -0.489679
C  4.337869 1.780867 1.012469
H  0.4434 2.259246 2.015642
H  1.124426 0.770591 2.632117
H  -1.871029 -1.295635 0.038997
H  -1.973693 -0.108152 -1.264895
H  -4.076784 1.088642 -1.702002
H  -3.773462 -1.589146 1.62478
H  -6.514704 1.189646 -1.403311
H  -6.210534 -1.495076 1.928891
H  1.838858 3.092387 -0.333062
H  1.860233 -1.881474 1.595583
H  4.577618 -0.546063 -2.305327
H  4.141985 -2.753141 1.347924
H  5.385537 1.579816 1.170169
elementType: Cl S N C H
totalener: -2653.53089530 hartree
nucrepener: 2629.64600166 hartree
electener: -5283.17689696 hartree
oneelecener: -8874.91616190 hartree
twoeener: 3591.73926494 hartree
cpcmener: -0.03215566 hartree
kineticenergy: 2647.22151477 hartree
xcener: -168.233614788004 hartree
chargesum: -0.0000000
charge: -0.086119 -0.099724 -0.097905 -0.060593 0.120274 -0.306386 -0.328570 -0.396037 -0.057387 -0.024194 0.154391 -0.004217 -0.180364 -0.196338 0.170770 -0.146148 -0.142417 0.034546 -0.036188 -0.223683 0.094542 -0.087288 -0.102861 0.057992 0.067560 0.143083 0.154565 0.121887 0.118339 0.146368 0.146249 0.145881 0.147272 0.174898 0.148208 0.124075 0.147593 0.157926
qa: -0.0861 -0.0997 -0.0979 -0.0606 0.1203 -0.3064 -0.3286 -0.3960 -0.0574 -0.0242 0.1544 -0.0042 -0.1804 -0.1963 0.1708 -0.1461 -0.1424 0.0345 -0.0362 -0.2237 0.0945 -0.0873 -0.1029 0.0580 0.0676 0.1431 0.1546 0.1219 0.1183 0.1464 0.1462 0.1459 0.1473 0.1749 0.1482 0.1241 0.1476 0.1579
va: 1.2357 1.2057 1.2041 2.4449 3.3500 2.9641 2.8641 2.9999 3.8589 3.8414 3.9871 3.6421 3.9743 3.9853 3.8006 3.9695 3.9651 4.0645 3.8677 4.0122 3.8258 3.9873 3.9524 3.8340 4.0331 1.0043 1.0002 1.0136 1.0191 1.0027 1.0031 1.0045 1.0038 1.0000 1.0016 1.0199 1.0003 0.9983
dispcorr: -0.022862540 hartree
energy: -2653.553757841344
dipole: -4.87708 3.51643 -1.36065 2.31138 -2.46897 -0.15759 8.53436 -7.44039 1.09398
magnitude: 1.75299 au
magnitude: 4.45575 debye
