program: Orca
programVersion: 4.2.1
elementType: Cl Cl Cl S N N N N C C C C C C C C C C C C C C C C C H H H H H H H H H H H H H
charge: 0
multiplicity: 1
keywords: wb97x-d3
keywords: def2-TZVPP
keywords: def2/J RIJCOSX GRIDX6 NOFINALGRIDX
keywords: grid4 nofinalgrid
keywords: scfconv7
keywords: smallprint printgap noloewdin
keywords: NOSOSCF
formula: C17H13Cl3N4S
InChI: InChI=1S/C17H13Cl3N4S/c18-13-3-1-12(2-4-13)9-25-17(8-24-11-21-10-22-24)23-16-6-5-14(19)7-15(16)20/h1-7,10-11H,8-9H2
38 atoms
Cl 1.735984 -1.63607 1.911473
Cl -8.183675 0.321811 -0.070162
Cl 6.176405 -2.087117 -1.081359
S  -1.47849 1.341435 -0.208035
N  2.286486 2.028672 0.578524
N  0.616064 -0.223938 -0.41496
N  3.491336 2.11785 0.009706
N  3.684487 1.640807 2.188082
C  1.076857 2.224047 -0.175447
C  -2.225071 -0.292724 -0.501764
C  0.228004 0.969116 -0.281841
C  -3.712262 -0.144481 -0.397861
C  -4.347327 -0.253019 0.83572
C  -4.479959 0.126132 -1.525927
C  1.946958 -0.596168 -0.563561
C  -5.721205 -0.110393 0.945443
C  -5.855666 0.271449 -1.434253
C  2.416959 1.74697 1.880142
C  2.587219 -1.318297 0.443684
C  2.645339 -0.364873 -1.745857
C  -6.464684 0.149912 -0.195395
C  3.887329 -1.769793 0.300801
C  3.93952 -0.822784 -1.915924
C  4.552972 -1.517137 -0.887135
C  4.298263 1.876436 1.009071
H  1.354162 2.56133 -1.174236
H  0.497103 3.03021 0.277408
H  -1.834801 -0.987182 0.241438
H  -1.922068 -0.645036 -1.487275
H  -3.766791 -0.458464 1.72685
H  -4.004758 0.219851 -2.494759
H  -6.203314 -0.203313 1.909122
H  -6.44181 0.475494 -2.31999
H  1.576736 1.634376 2.547619
H  2.160847 0.174247 -2.549711
H  4.367635 -2.312152 1.103504
H  4.462423 -0.631014 -2.84271
H  5.370015 1.870649 0.886435
elementType: Cl S N C H
totalener: -2653.54212986 hartree
nucrepener: 2628.59377959 hartree
electener: -5282.13590945 hartree
oneelecener: -8872.81453958 hartree
twoeener: 3590.67863012 hartree
cpcmener: -0.02797787 hartree
kineticenergy: 2647.20266251 hartree
xcener: -168.229586351001 hartree
chargesum: -0.0000000
charge: -0.085684 -0.097044 -0.096243 -0.058491 0.119615 -0.300851 -0.324638 -0.389915 -0.067837 -0.022758 0.152516 -0.006055 -0.188783 -0.180555 0.164735 -0.142672 -0.144386 0.037916 -0.034604 -0.218841 0.095343 -0.084929 -0.098704 0.058279 0.066765 0.152739 0.140845 0.117466 0.119423 0.143065 0.142925 0.145000 0.144138 0.172907 0.144352 0.123778 0.143531 0.157653
qa: -0.0857 -0.0970 -0.0962 -0.0585 0.1196 -0.3009 -0.3246 -0.3899 -0.0678 -0.0228 0.1525 -0.0061 -0.1888 -0.1806 0.1647 -0.1427 -0.1444 0.0379 -0.0346 -0.2188 0.0953 -0.0849 -0.0987 0.0583 0.0668 0.1527 0.1408 0.1175 0.1194 0.1431 0.1429 0.1450 0.1441 0.1729 0.1444 0.1238 0.1435 0.1577
va: 1.2343 1.2082 1.2055 2.4447 3.3420 2.9663 2.8632 3.0092 3.8693 3.8412 3.9853 3.6496 3.9848 3.9801 3.8110 3.9737 3.9735 4.0621 3.8761 4.0183 3.8378 3.9931 3.9619 3.8466 4.0327 1.0005 1.0051 1.0206 1.0149 1.0038 1.0038 1.0046 1.0051 0.9999 1.0023 1.0193 1.0020 0.9979
dispcorr: -0.022761150 hartree
energy: -2653.564891011892
dipole: -3.98719 2.82592 -1.16126 8.85094 -8.04936 0.80158 -4.89077 3.84477 -1.04600
magnitude: 1.75647 au
magnitude: 4.46458 debye
