program: Orca
programVersion: 4.2.1
elementType: Cl Cl Cl S N N N N C C C C C C C C C C C C C C C C C H H H H H H H H H H H H H
charge: 0
multiplicity: 1
keywords: wb97x-d3
keywords: def2-TZVPP
keywords: def2/J RIJCOSX GRIDX6 NOFINALGRIDX
keywords: grid4 nofinalgrid
keywords: scfconv7
keywords: smallprint printgap noloewdin
keywords: NOSOSCF
formula: C17H13Cl3N4S
InChI: InChI=1S/C17H13Cl3N4S/c18-13-3-1-12(2-4-13)9-25-17(8-24-11-21-10-22-24)23-16-6-5-14(19)7-15(16)20/h1-7,10-11H,8-9H2
38 atoms
Cl 2.23985 -0.927732 2.634882
Cl -4.694229 -1.155796 -3.088368
Cl 2.915156 -4.857809 -0.964335
S  -0.627146 2.475602 1.172403
N  2.085269 2.89027 0.270097
N  0.010799 -0.047527 0.841081
N  1.77763 3.919855 -0.522803
N  2.918635 4.621281 1.271468
C  1.666501 1.549433 -0.034511
C  -2.147581 1.584931 1.617736
C  0.387294 1.143456 0.666201
C  -2.799112 0.908458 0.447814
C  -3.168439 1.631583 -0.681731
C  -3.041992 -0.459914 0.471295
C  0.744082 -1.140372 0.397902
C  -3.754107 1.006289 -1.770943
C  -3.633544 -1.10197 -0.606056
C  2.76348 3.324111 1.338392
C  1.778685 -1.692204 1.153936
C  0.396071 -1.776443 -0.792558
C  -3.977714 -0.361222 -1.724319
C  2.450168 -2.832855 0.746439
C  1.057283 -2.913376 -1.220385
C  2.081602 -3.433494 -0.444829
C  2.299032 4.934089 0.114635
H  2.471814 0.862066 0.221609
H  1.515051 1.478583 -1.112364
H  -2.790976 2.362641 2.03526
H  -1.928845 0.880233 2.419169
H  -2.98815 2.69874 -0.727559
H  -2.756958 -1.043066 1.337027
H  -4.029731 1.581335 -2.644455
H  -3.810108 -2.168544 -0.572701
H  3.120233 2.667889 2.117606
H  -0.413903 -1.369432 -1.384004
H  3.250367 -3.238943 1.349678
H  0.771019 -3.386189 -2.149567
H  2.233528 5.940697 -0.267892
elementType: Cl S N C H
totalener: -2653.54242651 hartree
nucrepener: 2696.09497014 hartree
electener: -5349.63739665 hartree
oneelecener: -9007.20015874 hartree
twoeener: 3657.56276208 hartree
cpcmener: -0.02564852 hartree
kineticenergy: 2647.22813839 hartree
xcener: -168.233687188007 hartree
chargesum: 0.0000000
charge: -0.081407 -0.102928 -0.091178 -0.071044 0.073089 -0.291964 -0.333344 -0.401473 -0.082638 -0.030640 0.165557 0.077469 -0.226298 -0.201639 0.175903 -0.126851 -0.143206 0.093721 -0.076173 -0.211135 0.081933 -0.077065 -0.114257 0.058960 0.071870 0.156055 0.143993 0.152842 0.116648 0.133532 0.129303 0.144512 0.142886 0.164113 0.144613 0.126800 0.145912 0.163528
qa: -0.0814 -0.1029 -0.0912 -0.0710 0.0731 -0.2920 -0.3333 -0.4015 -0.0826 -0.0306 0.1656 0.0775 -0.2263 -0.2016 0.1759 -0.1269 -0.1432 0.0937 -0.0762 -0.2111 0.0819 -0.0771 -0.1143 0.0590 0.0719 0.1561 0.1440 0.1528 0.1166 0.1335 0.1293 0.1445 0.1429 0.1641 0.1446 0.1268 0.1459 0.1635
va: 1.2433 1.2019 1.2113 2.4017 3.3418 2.9888 2.8642 3.0346 3.8675 3.8121 3.9495 3.5403 4.0189 3.9416 3.7282 3.9640 3.9397 4.0485 3.9739 3.9978 3.8282 3.9994 3.9879 3.8617 4.0369 0.9925 1.0078 0.9982 1.0349 1.0145 1.0143 1.0040 1.0049 1.0015 1.0028 1.0180 1.0037 0.9940
dispcorr: -0.022400886 hartree
energy: -2653.564827393913
dipole: -5.65015 5.35239 -0.29776 16.03523 -16.49060 -0.45538 2.26158 -2.01714 0.24444
magnitude: 0.59647 au
magnitude: 1.51611 debye
