program: Orca
programVersion: 4.2.1
elementType: Cl Cl Cl S N N N N C C C C C C C C C C C C C C C C C H H H H H H H H H H H H H
charge: 0
multiplicity: 1
keywords: wb97x-d3
keywords: def2-TZVPP
keywords: def2/J RIJCOSX GRIDX6 NOFINALGRIDX
keywords: grid4 nofinalgrid
keywords: scfconv7
keywords: smallprint printgap noloewdin
keywords: NOSOSCF
formula: C17H13Cl3N4S
InChI: InChI=1S/C17H13Cl3N4S/c18-13-3-1-12(2-4-13)9-25-17(8-24-11-21-10-22-24)23-16-6-5-14(19)7-15(16)20/h1-7,10-11H,8-9H2
38 atoms
Cl 2.10181 -0.646219 2.839899
Cl -4.809289 -1.273518 -3.128238
Cl 2.871015 -5.015452 -0.193841
S  -0.595599 2.595532 0.786621
N  2.195853 2.813525 0.020607
N  -0.00128 0.039246 0.826624
N  1.930849 3.803559 -0.835566
N  3.106489 4.566052 0.910885
C  1.716467 1.475867 -0.197196
C  -2.147535 1.802113 1.299296
C  0.406113 1.188351 0.504221
C  -2.812682 1.036875 0.19395
C  -3.064836 -0.323635 0.3279
C  -3.196174 1.673036 -0.98325
C  0.726547 -1.114962 0.565688
C  -3.684124 -1.040962 -0.685077
C  -3.810633 0.971747 -2.008056
C  2.894393 3.283676 1.059797
C  1.703041 -1.585512 1.444055
C  0.429818 -1.888121 -0.555201
C  -4.04741 -0.385314 -1.849332
C  2.365644 -2.78173 1.221912
C  1.083594 -3.082553 -0.798109
C  2.048532 -3.520936 0.095196
C  2.496453 4.832853 -0.262247
H  2.482088 0.770477 0.123983
H  1.579026 1.333919 -1.270036
H  -2.769371 2.636483 1.630611
H  -1.957761 1.173191 2.168025
H  -2.771719 -0.839973 1.232389
H  -3.009377 2.732019 -1.115368
H  -3.871463 -2.09943 -0.564376
H  -4.100678 1.480316 -2.917531
H  3.225101 2.662657 1.878284
H  -0.333979 -1.544002 -1.240403
H  3.119992 -3.123685 1.917013
H  0.837274 -3.662987 -1.676475
H  2.474103 5.814964 -0.708062
elementType: Cl S N C H
totalener: -2653.54320706 hartree
nucrepener: 2686.38373766 hartree
electener: -5339.92694472 hartree
oneelecener: -8987.76743154 hartree
twoeener: 3647.84048682 hartree
cpcmener: -0.02582031 hartree
kineticenergy: 2647.22058052 hartree
xcener: -168.232082588597 hartree
chargesum: 0.0000000
charge: -0.080967 -0.102373 -0.090715 -0.071620 0.075079 -0.292972 -0.333330 -0.402010 -0.086667 -0.028638 0.167799 0.065766 -0.201266 -0.222744 0.172949 -0.138985 -0.130680 0.094784 -0.076460 -0.210447 0.081611 -0.076052 -0.110919 0.057097 0.072211 0.155338 0.146643 0.153577 0.116842 0.131454 0.133839 0.143563 0.144818 0.162412 0.144723 0.127034 0.145653 0.163654
qa: -0.0810 -0.1024 -0.0907 -0.0716 0.0751 -0.2930 -0.3333 -0.4020 -0.0867 -0.0286 0.1678 0.0658 -0.2013 -0.2227 0.1729 -0.1390 -0.1307 0.0948 -0.0765 -0.2104 0.0816 -0.0761 -0.1109 0.0571 0.0722 0.1553 0.1466 0.1536 0.1168 0.1315 0.1338 0.1436 0.1448 0.1624 0.1447 0.1270 0.1457 0.1637
va: 1.2432 1.2029 1.2114 2.4035 3.3403 2.9790 2.8628 3.0352 3.8741 3.8048 3.9461 3.5414 3.9428 4.0210 3.7230 3.9432 3.9681 4.0482 3.9727 3.9971 3.8355 3.9960 3.9784 3.8637 4.0353 0.9909 1.0072 0.9978 1.0363 1.0145 1.0137 1.0045 1.0039 1.0032 1.0035 1.0176 1.0033 0.9939
dispcorr: -0.022171161 hartree
energy: -2653.565378220059
dipole: -4.94555 4.64259 -0.30297 16.00874 -16.47800 -0.46926 -0.13620 0.31573 0.17953
magnitude: 0.58671 au
magnitude: 1.49129 debye
