program: Orca
programVersion: 4.2.1
elementType: Cl Cl Cl S N N N N C C C C C C C C C C C C C C C C C H H H H H H H H H H H H H
charge: 0
multiplicity: 1
keywords: wb97x-d3
keywords: def2-TZVPP
keywords: def2/J RIJCOSX GRIDX6 NOFINALGRIDX
keywords: grid4 nofinalgrid
keywords: scfconv7
keywords: smallprint printgap noloewdin
keywords: NOSOSCF
formula: C17H13Cl3N4S
InChI: InChI=1S/C17H13Cl3N4S/c18-13-3-1-12(2-4-13)9-25-17(8-24-11-21-10-22-24)23-16-6-5-14(19)7-15(16)20/h1-7,10-11H,8-9H2
38 atoms
Cl 1.377915 0.348905 3.182243
Cl -3.751922 -2.625834 -2.881779
Cl 3.190942 -3.770534 0.242719
S  -1.639836 3.137768 0.319297
N  2.159511 2.144723 -0.322635
N  -0.287241 0.953071 0.813813
N  2.787655 1.341642 -1.184743
N  4.02893 1.646049 0.652503
C  0.855052 2.675834 -0.604141
C  -2.928741 1.98454 0.885975
C  -0.250926 2.068855 0.235245
C  -3.149279 0.837163 -0.053943
C  -2.937887 -0.470066 0.369439
C  -3.55959 1.05514 -1.365961
C  0.607108 -0.089756 0.642194
C  -3.124829 -1.541568 -0.49073
C  -3.749775 -0.002991 -2.240038
C  2.912452 2.318913 0.769295
C  1.398282 -0.535183 1.699891
C  0.628542 -0.823972 -0.543098
C  -3.526337 -1.296626 -1.793013
C  2.204711 -1.654132 1.584291
C  1.414609 -1.953376 -0.673756
C  2.200575 -2.359153 0.392479
C  3.90135 1.065409 -0.559396
H  0.642363 2.511531 -1.660509
H  0.868197 3.75711 -0.451559
H  -3.819901 2.610272 0.96664
H  -2.680119 1.640095 1.888502
H  -2.612107 -0.661407 1.383406
H  -3.728323 2.06433 -1.722161
H  -2.947734 -2.551639 -0.146608
H  -4.068252 0.181273 -3.257202
H  2.612007 2.935746 1.601777
H  0.005016 -0.507946 -1.369101
H  2.819423 -1.970786 2.415555
H  1.412427 -2.506897 -1.60269
H  4.654279 0.426061 -0.992896
elementType: Cl S N C H
totalener: -2653.53921454 hartree
nucrepener: 2804.18491484 hartree
electener: -5457.72412939 hartree
oneelecener: -9224.25592330 hartree
twoeener: 3766.53179391 hartree
cpcmener: -0.02676977 hartree
kineticenergy: 2647.22282976 hartree
xcener: -168.236205960797 hartree
chargesum: 0.0000000
charge: -0.087274 -0.101565 -0.096726 -0.080289 0.119601 -0.267742 -0.334178 -0.389285 -0.067072 -0.046627 0.135885 0.055773 -0.187063 -0.229897 0.216071 -0.133720 -0.123041 0.035418 -0.081712 -0.249375 0.079768 -0.054796 -0.089820 0.052160 0.071455 0.149063 0.145580 0.152253 0.119147 0.132213 0.135938 0.140936 0.143854 0.175800 0.135362 0.121792 0.143622 0.158489
qa: -0.0873 -0.1016 -0.0967 -0.0803 0.1196 -0.2677 -0.3342 -0.3893 -0.0671 -0.0466 0.1359 0.0558 -0.1871 -0.2299 0.2161 -0.1337 -0.1230 0.0354 -0.0817 -0.2494 0.0798 -0.0548 -0.0898 0.0522 0.0715 0.1491 0.1456 0.1523 0.1191 0.1322 0.1359 0.1409 0.1439 0.1758 0.1354 0.1218 0.1436 0.1585
va: 1.2369 1.2042 1.2057 2.3874 3.3569 2.9313 2.8667 3.0142 3.8568 3.8226 4.0110 3.5620 3.9210 4.0172 3.6409 3.9319 3.9615 4.0562 3.8935 3.9846 3.8308 3.9742 3.9594 3.8540 4.0278 1.0054 0.9990 0.9988 1.0334 1.0144 1.0123 1.0061 1.0041 0.9989 1.0091 1.0206 1.0027 0.9975
dispcorr: -0.026386173 hartree
energy: -2653.565600717354
dipole: -7.53709 5.85910 -1.67799 15.60055 -13.61216 1.98839 -3.60205 3.38235 -0.21969
magnitude: 2.61106 au
magnitude: 6.63677 debye
