program: Orca
programVersion: 4.2.1
elementType: Cl Cl Cl S N N N N C C C C C C C C C C C C C C C C C H H H H H H H H H H H H H
charge: 0
multiplicity: 1
keywords: wb97x-d3
keywords: def2-TZVPP
keywords: def2/J RIJCOSX GRIDX6 NOFINALGRIDX
keywords: grid4 nofinalgrid
keywords: scfconv7
keywords: smallprint printgap noloewdin
keywords: NOSOSCF
formula: C17H13Cl3N4S
InChI: InChI=1S/C17H13Cl3N4S/c18-13-3-1-12(2-4-13)9-25-17(8-24-11-21-10-22-24)23-16-6-5-14(19)7-15(16)20/h1-7,10-11H,8-9H2
38 atoms
Cl 1.977475 -0.921932 3.161965
Cl -4.014738 -0.989826 -3.651841
Cl 2.703623 -5.083095 -0.151328
S  -0.637105 2.529157 1.323969
N  1.969205 2.792704 0.056219
N  -0.042838 -0.011469 1.095116
N  1.582211 2.927824 -1.213088
N  2.252863 4.894847 -0.379305
C  1.852517 1.529978 0.729552
C  -2.248605 1.700917 1.428076
C  0.41574 1.160673 1.028342
C  -2.670505 1.035592 0.150383
C  -3.025726 -0.308483 0.148541
C  -2.734637 1.743013 -1.045859
C  0.677118 -1.15993 0.803403
C  -3.445053 -0.939287 -1.013094
C  -3.14551 1.128053 -2.218264
C  2.361576 3.973793 0.544486
C  1.605724 -1.726178 1.677231
C  0.389507 -1.850579 -0.374867
C  -3.498749 -0.212313 -2.190627
C  2.231628 -2.930437 1.394396
C  1.010288 -3.046355 -0.680841
C  1.928633 -3.579596 0.211084
C  1.769399 4.202487 -1.430679
H  2.405515 1.590572 1.668162
H  2.320734 0.755033 0.121953
H  -2.935935 2.507316 1.694505
H  -2.239429 0.996177 2.258637
H  -2.969444 -0.881073 1.065248
H  -2.454118 2.788882 -1.07648
H  -3.7159 -1.986432 -0.995102
H  -3.18851 1.691166 -3.140772
H  2.715289 4.104117 1.555423
H  -0.340914 -1.433267 -1.055768
H  2.945857 -3.348858 2.090109
H  0.771422 -3.556485 -1.603673
H  1.557317 4.653723 -2.387682
elementType: Cl S N C H
totalener: -2653.54311253 hartree
nucrepener: 2710.38228325 hartree
electener: -5363.92539578 hartree
oneelecener: -9036.26197787 hartree
twoeener: 3672.33658209 hartree
cpcmener: -0.02627487 hartree
kineticenergy: 2647.22197249 hartree
xcener: -168.233144635366 hartree
chargesum: 0.0000000
charge: -0.081782 -0.103502 -0.090608 -0.080368 0.060526 -0.277974 -0.330060 -0.403659 -0.063800 -0.039837 0.169477 0.100227 -0.225090 -0.220370 0.135788 -0.142362 -0.127305 0.074910 -0.025248 -0.196736 0.085612 -0.088807 -0.126194 0.069157 0.067359 0.136965 0.149503 0.150841 0.116630 0.129793 0.129635 0.143801 0.144032 0.182386 0.143949 0.125874 0.144611 0.162625
qa: -0.0818 -0.1035 -0.0906 -0.0804 0.0605 -0.2780 -0.3301 -0.4037 -0.0638 -0.0398 0.1695 0.1002 -0.2251 -0.2204 0.1358 -0.1424 -0.1273 0.0749 -0.0252 -0.1967 0.0856 -0.0888 -0.1262 0.0692 0.0674 0.1370 0.1495 0.1508 0.1166 0.1298 0.1296 0.1438 0.1440 0.1824 0.1439 0.1259 0.1446 0.1626
va: 1.2448 1.2011 1.2118 2.4019 3.4141 2.9883 2.8690 3.0263 3.8568 3.8247 3.9415 3.5215 3.9464 4.0135 3.7455 3.9322 3.9659 4.0409 3.9698 4.0003 3.8255 4.0075 4.0070 3.8483 4.0496 1.0016 0.9991 0.9980 1.0333 1.0128 1.0173 1.0046 1.0038 0.9890 1.0037 1.0176 1.0046 0.9944
dispcorr: -0.022595414 hartree
energy: -2653.565707942979
dipole: -5.66201 5.65513 -0.00688 16.80239 -16.80266 -0.00027 0.92989 0.38929 1.31918
magnitude: 1.31920 au
magnitude: 3.35313 debye
