program: Orca
programVersion: 4.2.1
elementType: Cl Cl Cl S N N N N C C C C C C C C C C C C C C C C C H H H H H H H H H H H H H
charge: 0
multiplicity: 1
keywords: wb97x-d3
keywords: def2-TZVPP
keywords: def2/J RIJCOSX GRIDX6 NOFINALGRIDX
keywords: grid4 nofinalgrid
keywords: scfconv7
keywords: smallprint printgap noloewdin
keywords: NOSOSCF
formula: C17H13Cl3N4S
InChI: InChI=1S/C17H13Cl3N4S/c18-13-3-1-12(2-4-13)9-25-17(8-24-11-21-10-22-24)23-16-6-5-14(19)7-15(16)20/h1-7,10-11H,8-9H2
38 atoms
Cl 2.036183 -1.165893 3.097117
Cl -3.70698 -0.729648 -3.797406
Cl 2.813539 -4.894591 -0.690716
S  -0.763395 2.361453 1.712712
N  1.782774 2.799208 0.2989
N  -0.073289 -0.109509 1.196055
N  1.35202 2.880846 -0.960437
N  1.910767 4.905671 -0.185155
C  1.756775 1.544723 0.996679
C  -2.348897 1.480726 1.628866
C  0.341526 1.077905 1.264076
C  -2.668615 0.938223 0.265553
C  -2.594183 1.738173 -0.87014
C  -3.065199 -0.38641 0.121499
C  0.679973 -1.187954 0.759605
C  -2.911257 1.233279 -2.121113
C  -3.392861 -0.907315 -1.121272
C  2.106537 4.014335 0.753092
C  1.650544 -1.814396 1.541145
C  0.386982 -1.744898 -0.485804
C  -3.310058 -0.089574 -2.23608
C  2.308977 -2.954333 1.106225
C  1.040611 -2.872668 -0.943125
C  1.997821 -3.472587 -0.138472
C  1.449768 4.15984 -1.210497
H  2.282003 1.66704 1.945026
H  2.296468 0.798194 0.413625
H  -3.079067 2.235361 1.930175
H  -2.365868 0.694429 2.381949
H  -2.272219 2.768965 -0.790031
H  -3.113317 -1.032089 0.989203
H  -2.845257 1.866598 -2.995534
H  -3.69686 -1.941258 -1.214735
H  2.475736 4.192735 1.751149
H  -0.375452 -1.275656 -1.093941
H  3.055461 -3.424108 1.731749
H  0.798606 -3.280624 -1.914756
H  1.181053 4.575409 -2.169114
elementType: Cl S N C H
totalener: -2653.54211703 hartree
nucrepener: 2728.65164326 hartree
electener: -5382.19376029 hartree
oneelecener: -9072.89973933 hartree
twoeener: 3690.70597904 hartree
cpcmener: -0.02592185 hartree
kineticenergy: 2647.22441584 hartree
xcener: -168.233381237361 hartree
chargesum: -0.0000000
charge: -0.080646 -0.103449 -0.090632 -0.084795 0.067702 -0.273181 -0.330602 -0.405144 -0.071165 -0.040067 0.169510 0.101982 -0.210697 -0.222783 0.131090 -0.128408 -0.150413 0.073952 -0.022736 -0.174496 0.088806 -0.095221 -0.138747 0.076764 0.068539 0.138005 0.148568 0.149006 0.113931 0.126610 0.129963 0.143225 0.143215 0.181945 0.137866 0.126306 0.143753 0.162445
qa: -0.0806 -0.1034 -0.0906 -0.0848 0.0677 -0.2732 -0.3306 -0.4051 -0.0712 -0.0401 0.1695 0.1020 -0.2107 -0.2228 0.1311 -0.1284 -0.1504 0.0740 -0.0227 -0.1745 0.0888 -0.0952 -0.1387 0.0768 0.0685 0.1380 0.1486 0.1490 0.1139 0.1266 0.1300 0.1432 0.1432 0.1819 0.1379 0.1263 0.1438 0.1624
va: 1.2463 1.2006 1.2119 2.3945 3.4116 3.0058 2.8682 3.0247 3.8673 3.8342 3.9309 3.5377 4.0025 3.9466 3.7675 3.9730 3.9386 4.0431 3.9645 3.9940 3.8162 4.0117 4.0334 3.8434 4.0428 1.0017 0.9992 0.9979 1.0334 1.0190 1.0105 1.0042 1.0052 0.9894 1.0060 1.0177 1.0059 0.9945
dispcorr: -0.023231173 hartree
energy: -2653.565348199640
dipole: -6.81402 6.79455 -0.01947 16.48848 -16.48396 0.00451 2.66152 -1.23869 1.42283
magnitude: 1.42297 au
magnitude: 3.61690 debye
