program: Orca
programVersion: 4.2.1
elementType: Cl Cl Cl S N N N N C C C C C C C C C C C C C C C C C H H H H H H H H H H H H H
charge: 0
multiplicity: 1
keywords: wb97x-d3
keywords: def2-TZVPP
keywords: def2/J RIJCOSX GRIDX6 NOFINALGRIDX
keywords: grid4 nofinalgrid
keywords: scfconv7
keywords: smallprint printgap noloewdin
keywords: NOSOSCF
formula: C17H13Cl3N4S
InChI: InChI=1S/C17H13Cl3N4S/c18-13-3-1-12(2-4-13)9-25-17(8-24-11-21-10-22-24)23-16-6-5-14(19)7-15(16)20/h1-7,10-11H,8-9H2
38 atoms
Cl 1.637266 0.23082 3.317684
Cl -4.338702 -1.447474 -3.747746
Cl 4.145115 -3.455009 0.329545
S  -1.742315 2.548637 1.286831
N  1.884319 2.063169 -0.105314
N  -0.274779 0.39784 0.989182
N  1.556973 1.852357 -1.381256
N  3.674275 1.234498 -0.997304
C  0.920002 2.584919 0.819365
C  -2.950948 1.204702 1.465515
C  -0.263174 1.656197 1.003976
C  -3.290657 0.541202 0.164558
C  -3.935143 1.252022 -0.844191
C  -2.982356 -0.796295 -0.055728
C  0.817816 -0.437931 0.827663
C  -4.261696 0.64975 -2.048145
C  -3.304753 -1.416999 -1.254011
C  3.147367 1.685283 0.112046
C  1.748629 -0.667106 1.842431
C  0.938254 -1.189341 -0.341249
C  -3.939314 -0.684856 -2.24326
C  2.769913 -1.591861 1.701935
C  1.958224 -2.106415 -0.506521
C  2.868998 -2.301552 0.51942
C  2.659531 1.354319 -1.877176
H  0.584539 3.561961 0.470121
H  1.406868 2.742365 1.782208
H  -3.827016 1.69098 1.8984
H  -2.576319 0.492226 2.199544
H  -4.187791 2.295431 -0.697409
H  -2.480535 -1.36851 0.712941
H  -4.762029 1.21614 -2.821899
H  -3.055767 -2.458019 -1.409758
H  3.628727 1.766042 1.074082
H  0.215755 -1.040491 -1.132252
H  3.478451 -1.745349 2.503737
H  2.035447 -2.664821 -1.428905
H  2.739142 1.068849 -2.914154
elementType: Cl S N C H
totalener: -2653.54177445 hartree
nucrepener: 2766.78980014 hartree
electener: -5420.33157459 hartree
oneelecener: -9149.60740228 hartree
twoeener: 3729.27582769 hartree
cpcmener: -0.02606910 hartree
kineticenergy: 2647.23464021 hartree
xcener: -168.239410453133 hartree
chargesum: -0.0000000
charge: -0.081354 -0.101584 -0.093977 -0.071093 0.121428 -0.277479 -0.336178 -0.385334 -0.120594 -0.046239 0.171463 0.054595 -0.216796 -0.192171 0.232853 -0.128772 -0.137945 0.072515 -0.100672 -0.239500 0.078752 -0.070059 -0.105870 0.064549 0.057841 0.135274 0.151920 0.155091 0.118681 0.135303 0.133913 0.143787 0.143561 0.168019 0.138066 0.123441 0.143694 0.160873
qa: -0.0814 -0.1016 -0.0940 -0.0711 0.1214 -0.2775 -0.3362 -0.3853 -0.1206 -0.0462 0.1715 0.0546 -0.2168 -0.1922 0.2329 -0.1288 -0.1379 0.0725 -0.1007 -0.2395 0.0788 -0.0701 -0.1059 0.0645 0.0578 0.1353 0.1519 0.1551 0.1187 0.1353 0.1339 0.1438 0.1436 0.1680 0.1381 0.1234 0.1437 0.1609
va: 1.2469 1.2042 1.2094 2.4019 3.3319 2.9888 2.8500 3.0220 3.9145 3.8059 3.9503 3.5489 4.0207 3.9546 3.6411 3.9624 3.9465 4.0529 3.9688 3.9542 3.8448 3.9827 3.9732 3.8600 4.0566 1.0144 0.9989 0.9980 1.0340 1.0113 1.0121 1.0043 1.0051 0.9957 1.0167 1.0189 1.0033 0.9964
dispcorr: -0.025152209 hartree
energy: -2653.566926662353
dipole: -8.21024 7.35404 -0.85620 11.51522 -10.18384 1.33138 0.14440 1.35937 1.50377
magnitude: 2.18334 au
magnitude: 5.54961 debye
