program: Orca
programVersion: 4.2.1
elementType: Cl Cl Cl S N N N N C C C C C C C C C C C C C C C C C H H H H H H H H H H H H H
charge: 0
multiplicity: 1
keywords: wb97x-d3
keywords: def2-TZVPP
keywords: def2/J RIJCOSX GRIDX6 NOFINALGRIDX
keywords: grid4 nofinalgrid
keywords: scfconv7
keywords: smallprint printgap noloewdin
keywords: NOSOSCF
formula: C17H13Cl3N4S
InChI: InChI=1S/C17H13Cl3N4S/c18-13-3-1-12(2-4-13)9-25-17(8-24-11-21-10-22-24)23-16-6-5-14(19)7-15(16)20/h1-7,10-11H,8-9H2
38 atoms
Cl 2.088246 -0.913453 3.245678
Cl -3.525998 -0.688626 -3.850719
Cl 3.053248 -4.817328 -0.312968
S  -0.831956 2.379214 1.736617
N  1.563141 2.633091 -0.070805
N  -0.105419 -0.11132 1.335902
N  1.885862 3.893601 0.221983
N  1.088538 3.748887 -1.865214
C  1.652458 1.579463 0.906873
C  -2.421037 1.503467 1.638771
C  0.277951 1.08979 1.31145
C  -2.705355 0.96574 0.266865
C  -2.662798 1.792145 -0.852467
C  -3.016082 -0.377463 0.090812
C  0.69211 -1.180064 0.947095
C  -2.914548 1.292382 -2.119979
C  -3.27962 -0.893753 -1.169806
C  1.081818 2.560716 -1.314799
C  1.714472 -1.690643 1.747797
C  0.416449 -1.834038 -0.253137
C  -3.219323 -0.052197 -2.267834
C  2.441407 -2.80938 1.372373
C  1.137969 -2.943781 -0.651358
C  2.146887 -3.425246 0.168658
C  1.590041 4.525401 -0.88428
H  2.181111 1.975842 1.773613
H  2.247404 0.759206 0.505484
H  -3.153831 2.260266 1.92724
H  -2.451967 0.71745 2.391513
H  -2.419121 2.84209 -0.745556
H  -3.046658 -1.041586 0.945159
H  -2.872059 1.947278 -2.979773
H  -3.515985 -1.942737 -1.287981
H  0.747445 1.639352 -1.76712
H  -0.383311 -1.459746 -0.879083
H  3.229044 -3.18517 2.010688
H  0.909046 -3.426104 -1.591498
H  1.748233 5.587195 -0.991808
elementType: Cl S N C H
totalener: -2653.54061553 hartree
nucrepener: 2743.30261619 hartree
electener: -5396.84323172 hartree
oneelecener: -9101.38751673 hartree
twoeener: 3704.54428501 hartree
cpcmener: -0.02449719 hartree
kineticenergy: 2647.22380109 hartree
xcener: -168.232320174778 hartree
chargesum: 0.0000000
charge: -0.075860 -0.101141 -0.088631 -0.076752 0.090690 -0.263972 -0.338354 -0.400482 -0.074802 -0.036302 0.107248 0.109204 -0.249388 -0.219293 0.162876 -0.125987 -0.153455 0.080366 -0.039778 -0.178699 0.099615 -0.095712 -0.146991 0.077012 0.068572 0.144484 0.161662 0.150914 0.114037 0.133890 0.132507 0.144768 0.145930 0.164185 0.142473 0.126850 0.144897 0.163417
qa: -0.0759 -0.1011 -0.0886 -0.0768 0.0907 -0.2640 -0.3384 -0.4005 -0.0748 -0.0363 0.1072 0.1092 -0.2494 -0.2193 0.1629 -0.1260 -0.1535 0.0804 -0.0398 -0.1787 0.0996 -0.0957 -0.1470 0.0770 0.0686 0.1445 0.1617 0.1509 0.1140 0.1339 0.1325 0.1448 0.1459 0.1642 0.1425 0.1269 0.1449 0.1634
va: 1.2500 1.2042 1.2135 2.3864 3.3750 3.0077 2.8610 3.0208 3.8491 3.8230 3.9871 3.5040 3.9891 3.9376 3.7452 3.9528 3.9214 4.0532 3.9821 3.9745 3.8167 4.0178 4.0419 3.8496 4.0406 1.0124 0.9909 0.9981 1.0340 1.0178 1.0111 1.0038 1.0038 0.9975 1.0030 1.0176 1.0051 0.9937
dispcorr: -0.024188515 hartree
energy: -2653.564804041653
dipole: -8.50038 8.07842 -0.42197 14.88348 -15.43496 -0.55148 0.44662 0.33010 0.77672
magnitude: 1.04187 au
magnitude: 2.64821 debye
