program: Orca
programVersion: 4.2.1
elementType: Cl Cl Cl S N N N N C C C C C C C C C C C C C C C C C H H H H H H H H H H H H H
charge: 0
multiplicity: 1
keywords: wb97x-d3
keywords: def2-TZVPP
keywords: def2/J RIJCOSX GRIDX6 NOFINALGRIDX
keywords: grid4 nofinalgrid
keywords: scfconv7
keywords: smallprint printgap noloewdin
keywords: NOSOSCF
formula: C17H13Cl3N4S
InChI: InChI=1S/C17H13Cl3N4S/c18-13-3-1-12(2-4-13)9-25-17(8-24-11-21-10-22-24)23-16-6-5-14(19)7-15(16)20/h1-7,10-11H,8-9H2
38 atoms
Cl 1.991703 -0.502383 3.448439
Cl -3.307935 -1.025564 -3.882838
Cl 2.918121 -4.866073 0.458251
S  -0.82384 2.624404 1.443225
N  1.575327 2.46718 -0.426095
N  -0.151385 0.086203 1.405189
N  1.866555 3.768223 -0.424235
N  1.135729 3.1277 -2.441448
C  1.648534 1.669714 0.772172
C  -2.435863 1.789441 1.358881
C  0.261953 1.264474 1.226408
C  -2.661355 1.095722 0.047352
C  -3.017584 -0.247322 0.016428
C  -2.516341 1.774604 -1.159374
C  0.627571 -1.041789 1.178517
C  -3.228343 -0.906417 -1.186538
C  -2.713859 1.13089 -2.370111
C  1.131805 2.098989 -1.631109
C  1.623715 -1.463645 2.059999
C  0.35694 -1.842408 0.069611
C  -3.067443 -0.209903 -2.372549
C  2.329055 -2.638459 1.850136
C  1.05813 -3.010439 -0.164717
C  2.040273 -3.401383 0.732252
C  1.594491 4.120595 -1.653978
H  2.142563 2.266633 1.538402
H  2.267093 0.79174 0.587855
H  -3.155236 2.597958 1.508261
H  -2.539092 1.10387 2.198562
H  -3.126673 -0.798925 0.941481
H  -2.233804 2.820128 -1.165248
H  -3.501154 -1.953262 -1.191407
H  -2.5918 1.672164 -3.298573
H  0.829752 1.090326 -1.868214
H  -0.424082 -1.537976 -0.615171
H  3.095798 -2.944196 2.548553
H  0.833479 -3.608141 -1.03722
H  1.733844 5.133218 -1.998885
elementType: Cl S N C H
totalener: -2653.54017196 hartree
nucrepener: 2754.84809880 hartree
electener: -5408.38827076 hartree
oneelecener: -9124.51196078 hartree
twoeener: 3716.12369002 hartree
cpcmener: -0.02427663 hartree
kineticenergy: 2647.22165513 hartree
xcener: -168.231907703485 hartree
chargesum: 0.0000000
charge: -0.075096 -0.100735 -0.088348 -0.077080 0.098853 -0.261142 -0.336035 -0.400846 -0.082548 -0.038689 0.101533 0.100501 -0.217347 -0.242001 0.177528 -0.152558 -0.129221 0.077191 -0.048000 -0.175159 0.102447 -0.095836 -0.155235 0.079431 0.066769 0.146936 0.161879 0.151636 0.113831 0.133924 0.133700 0.146188 0.143323 0.165494 0.139634 0.126940 0.144189 0.163950
qa: -0.0751 -0.1007 -0.0883 -0.0771 0.0989 -0.2611 -0.3360 -0.4008 -0.0825 -0.0387 0.1015 0.1005 -0.2173 -0.2420 0.1775 -0.1526 -0.1292 0.0772 -0.0480 -0.1752 0.1024 -0.0958 -0.1552 0.0794 0.0668 0.1469 0.1619 0.1516 0.1138 0.1339 0.1337 0.1462 0.1433 0.1655 0.1396 0.1269 0.1442 0.1639
va: 1.2501 1.2047 1.2140 2.3794 3.3776 3.0142 2.8682 3.0167 3.8623 3.8248 3.9922 3.5170 3.9324 3.9814 3.7386 3.9162 3.9546 4.0518 3.9844 3.9600 3.8147 4.0210 4.0538 3.8511 4.0415 1.0131 0.9911 0.9974 1.0341 1.0103 1.0172 1.0039 1.0058 0.9972 1.0051 1.0176 1.0055 0.9937
dispcorr: -0.024730956 hartree
energy: -2653.564902920545
dipole: -8.39766 7.95997 -0.43769 14.80759 -15.16705 -0.35946 -1.90241 2.83497 0.93255
magnitude: 1.09107 au
magnitude: 2.77329 debye
