program: Orca
programVersion: 4.2.1
elementType: Cl Cl Cl S N N N N C C C C C C C C C C C C C C C C C H H H H H H H H H H H H H
charge: 0
multiplicity: 1
keywords: wb97x-d3
keywords: def2-TZVPP
keywords: def2/J RIJCOSX GRIDX6 NOFINALGRIDX
keywords: grid4 nofinalgrid
keywords: scfconv7
keywords: smallprint printgap noloewdin
keywords: NOSOSCF
formula: C17H13Cl3N4S
InChI: InChI=1S/C17H13Cl3N4S/c18-13-3-1-12(2-4-13)9-25-17(8-24-11-21-10-22-24)23-16-6-5-14(19)7-15(16)20/h1-7,10-11H,8-9H2
38 atoms
Cl 0.182458 -1.99819 1.655088
Cl -4.225454 -1.607642 1.640295
Cl 0.6939 -4.419344 -3.103897
S  1.01739 2.327661 -1.011877
N  1.716147 3.443086 1.63568
N  1.820156 0.125158 0.475857
N  0.516497 3.380635 2.214454
N  1.100385 5.509701 1.843175
C  2.439974 2.247227 1.302942
C  -0.265776 1.320999 -1.805688
C  1.740561 1.368922 0.284947
C  -1.223217 0.605392 -0.89621
C  -1.601026 1.099847 0.346647
C  -1.789954 -0.585238 -1.341144
C  1.507049 -0.886448 -0.410765
C  -2.528851 0.427765 1.126935
C  -2.717516 -1.269181 -0.572981
C  2.051231 4.716467 1.415512
C  0.790123 -1.996135 0.045385
C  1.995945 -0.920223 -1.71647
C  -3.079832 -0.75301 0.660059
C  0.532786 -3.080684 -0.77282
C  1.755394 -1.999681 -2.548995
C  1.016852 -3.069549 -2.070962
C  0.186469 4.641894 2.320055
H  2.612216 1.653154 2.198956
H  3.414127 2.543125 0.909143
H  0.180265 0.631636 -2.520193
H  -0.801909 2.071029 -2.394713
H  -1.16442 2.01233 0.733026
H  -1.502256 -0.99553 -2.301624
H  -2.807366 0.82222 2.094765
H  -3.141522 -2.197337 -0.931457
H  2.98133 5.008212 0.953004
H  2.590503 -0.092955 -2.083585
H  -0.044238 -3.916812 -0.402973
H  2.14534 -2.000119 -3.557525
H  -0.749246 4.949987 2.760328
elementType: Cl S N C H
totalener: -2653.53659517 hartree
nucrepener: 2824.51849982 hartree
electener: -5478.05509498 hartree
oneelecener: -9264.89649402 hartree
twoeener: 3786.84139903 hartree
cpcmener: -0.02851933 hartree
kineticenergy: 2647.23069266 hartree
xcener: -168.239949823732 hartree
chargesum: -0.0000000
charge: -0.072464 -0.103380 -0.090556 -0.092451 0.081667 -0.257108 -0.357031 -0.409542 -0.033254 -0.064506 0.100348 0.019621 -0.128030 -0.188976 0.170943 -0.183075 -0.164163 0.078452 0.031501 -0.245072 0.126319 -0.114068 -0.124769 0.069057 0.086152 0.122022 0.138948 0.133033 0.157038 0.132141 0.138221 0.133955 0.136755 0.178991 0.165368 0.119281 0.146311 0.162317
qa: -0.0725 -0.1034 -0.0906 -0.0925 0.0817 -0.2571 -0.3570 -0.4095 -0.0333 -0.0645 0.1003 0.0196 -0.1280 -0.1890 0.1709 -0.1831 -0.1642 0.0785 0.0315 -0.2451 0.1263 -0.1141 -0.1248 0.0691 0.0862 0.1220 0.1389 0.1330 0.1570 0.1321 0.1382 0.1340 0.1368 0.1790 0.1654 0.1193 0.1463 0.1623
va: 1.2503 1.2007 1.2132 2.4020 3.3820 3.0308 2.8354 3.0258 3.7970 3.8964 4.0542 3.6119 3.8913 3.9252 3.7538 4.0553 3.9942 4.0446 3.9178 4.0008 3.7739 3.9859 3.9901 3.8313 4.0143 1.0229 0.9953 1.0077 0.9913 1.0368 0.9948 1.0104 1.0088 0.9899 0.9992 1.0250 1.0043 0.9939
dispcorr: -0.026998550 hartree
energy: -2653.563593716055
dipole: 7.98657 -6.39682 1.58976 20.66015 -20.16939 0.49076 -4.46619 2.67755 -1.78864
magnitude: 2.44282 au
magnitude: 6.20917 debye
