program: Orca
programVersion: 4.2.1
elementType: Cl Cl Cl S N N N N C C C C C C C C C C C C C C C C C H H H H H H H H H H H H H
charge: 0
multiplicity: 1
keywords: wb97x-d3
keywords: def2-TZVPP
keywords: def2/J RIJCOSX GRIDX6 NOFINALGRIDX
keywords: grid4 nofinalgrid
keywords: scfconv7
keywords: smallprint printgap noloewdin
keywords: NOSOSCF
formula: C17H13Cl3N4S
InChI: InChI=1S/C17H13Cl3N4S/c18-13-3-1-12(2-4-13)9-25-17(8-24-11-21-10-22-24)23-16-6-5-14(19)7-15(16)20/h1-7,10-11H,8-9H2
38 atoms
Cl 0.120808 -1.145484 0.973893
Cl -4.172604 -2.343736 1.669113
Cl 3.195293 -4.482963 -1.899928
S  -0.400609 3.019528 -0.533299
N  1.890567 2.60222 1.234777
N  0.346479 0.660204 -1.393407
N  1.289515 2.135448 2.329414
N  1.973117 4.24546 2.64312
C  1.992431 1.800488 0.048673
C  -1.900324 2.352825 -1.315649
C  0.673271 1.645248 -0.677793
C  -2.481164 1.187622 -0.570275
C  -2.827277 1.298488 0.772272
C  -2.68072 -0.029122 -1.211272
C  1.079741 -0.514324 -1.472108
C  -3.352257 0.220835 1.466066
C  -3.210611 -1.116987 -0.535108
C  2.29092 3.863165 1.43298
C  1.020998 -1.478044 -0.460353
C  1.808693 -0.817776 -2.620335
C  -3.534348 -0.982944 0.803796
C  1.667407 -2.69727 -0.584309
C  2.465893 -2.027395 -2.758206
C  2.388215 -2.960385 -1.736654
C  1.363353 3.151982 3.146648
H  2.403226 0.826311 0.30913
H  2.701487 2.278739 -0.629481
H  -1.682648 2.098549 -2.352022
H  -2.587262 3.201841 -1.324885
H  -2.676354 2.234219 1.296683
H  -2.409766 -0.139586 -2.253375
H  -3.611333 0.320431 2.511471
H  -3.351862 -2.059697 -1.046314
H  2.801484 4.44357 0.680121
H  1.852314 -0.089942 -3.420028
H  1.607919 -3.427062 0.211412
H  3.028568 -2.23724 -3.657412
H  0.967704 3.107109 4.149501
elementType: Cl S N C H
totalener: -2653.54121130 hartree
nucrepener: 2785.52793285 hartree
electener: -5439.06914415 hartree
oneelecener: -9187.36368111 hartree
twoeener: 3748.29453697 hartree
cpcmener: -0.02867228 hartree
kineticenergy: 2647.23393841 hartree
xcener: -168.236856342505 hartree
chargesum: 0.0000000
charge: -0.072633 -0.107018 -0.093603 -0.082095 0.070879 -0.280113 -0.321008 -0.406571 -0.080678 -0.040650 0.186745 0.095010 -0.222186 -0.205758 0.164051 -0.127463 -0.133776 0.071084 -0.052440 -0.246810 0.078564 -0.080407 -0.093904 0.057125 0.069319 0.146760 0.149001 0.114729 0.150875 0.126345 0.127604 0.141740 0.139379 0.181252 0.143793 0.126695 0.144489 0.161675
qa: -0.0726 -0.1070 -0.0936 -0.0821 0.0709 -0.2801 -0.3210 -0.4066 -0.0807 -0.0406 0.1867 0.0950 -0.2222 -0.2058 0.1641 -0.1275 -0.1338 0.0711 -0.0524 -0.2468 0.0786 -0.0804 -0.0939 0.0571 0.0693 0.1468 0.1490 0.1147 0.1509 0.1263 0.1276 0.1417 0.1394 0.1813 0.1438 0.1267 0.1445 0.1617
va: 1.2520 1.1969 1.2091 2.3996 3.3886 2.9526 2.8650 3.0268 3.8696 3.8299 3.9377 3.5144 4.0281 3.9528 3.6758 3.9539 3.9500 4.0402 3.9813 4.0392 3.8120 3.9872 3.9586 3.8667 4.0379 1.0000 0.9977 1.0343 0.9988 1.0169 1.0139 1.0044 1.0050 0.9902 1.0113 1.0200 1.0034 0.9941
dispcorr: -0.024289018 hartree
energy: -2653.565500320739
dipole: 0.41314 0.44266 0.85579 20.67618 -19.51182 1.16436 -6.05531 3.89794 -2.15737
magnitude: 2.59660 au
magnitude: 6.60004 debye
