program: Orca
programVersion: 4.2.1
elementType: Cl Cl Cl S N N N N C C C C C C C C C C C C C C C C C H H H H H H H H H H H H H
charge: 0
multiplicity: 1
keywords: wb97x-d3
keywords: def2-TZVPP
keywords: def2/J RIJCOSX GRIDX6 NOFINALGRIDX
keywords: grid4 nofinalgrid
keywords: scfconv7
keywords: smallprint printgap noloewdin
keywords: NOSOSCF
formula: C17H13Cl3N4S
InChI: InChI=1S/C17H13Cl3N4S/c18-13-3-1-12(2-4-13)9-25-17(8-24-11-21-10-22-24)23-16-6-5-14(19)7-15(16)20/h1-7,10-11H,8-9H2
38 atoms
Cl -0.459056 -1.210382 1.360306
Cl -4.846093 -2.280717 0.623589
Cl 2.929892 -4.754835 -0.824109
S  -0.389005 2.964262 -0.124104
N  2.410066 2.708271 1.079022
N  0.432294 0.589792 -0.871469
N  2.08948 3.804269 1.769327
N  3.907205 4.1671 0.512984
C  1.5899 1.523728 1.109506
C  -1.65439 2.429578 -1.316975
C  0.596295 1.518146 -0.033439
C  -2.467955 1.264013 -0.837577
C  -2.504985 0.082826 -1.56927
C  -3.193399 1.335669 0.347273
C  1.064983 -0.640907 -0.800408
C  -3.240218 -1.008593 -1.133911
C  -3.929925 0.25345 0.801322
C  3.4912 2.939522 0.329102
C  0.714452 -1.59919 0.154747
C  2.002303 -0.99853 -1.768846
C  -3.941569 -0.914863 0.055765
C  1.280231 -2.86461 0.152701
C  2.586547 -2.251545 -1.778671
C  2.217467 -3.178349 -0.81589
C  3.016532 4.650424 1.401739
H  1.066819 1.495866 2.064735
H  2.237635 0.64927 1.058084
H  -1.180593 2.221556 -2.275467
H  -2.275106 3.318746 -1.448968
H  -1.943987 0.003243 -2.491235
H  -3.179013 2.242195 0.94047
H  -3.251656 -1.922024 -1.713199
H  -4.484919 0.323126 1.72711
H  3.932393 2.194273 -0.314791
H  2.271326 -0.274837 -2.527084
H  0.991488 -3.58978 0.901011
H  3.317546 -2.499969 -2.535654
H  3.055852 5.655527 1.791835
elementType: Cl S N C H
totalener: -2653.54082683 hartree
nucrepener: 2753.10929578 hartree
electener: -5406.65012261 hartree
oneelecener: -9121.60628511 hartree
twoeener: 3714.95616250 hartree
cpcmener: -0.02649890 hartree
kineticenergy: 2647.22915340 hartree
xcener: -168.234064320576 hartree
chargesum: -0.0000000
charge: -0.079411 -0.105708 -0.090454 -0.073919 0.077927 -0.257191 -0.333577 -0.405881 -0.073755 -0.045371 0.126529 0.093658 -0.202263 -0.235683 0.161042 -0.134941 -0.127680 0.087423 -0.035187 -0.252287 0.080616 -0.073122 -0.088580 0.057814 0.071928 0.139326 0.152684 0.118352 0.150902 0.129844 0.131478 0.140565 0.142239 0.170885 0.145011 0.127933 0.145837 0.163015
qa: -0.0794 -0.1057 -0.0905 -0.0739 0.0779 -0.2572 -0.3336 -0.4059 -0.0738 -0.0454 0.1265 0.0937 -0.2023 -0.2357 0.1610 -0.1349 -0.1277 0.0874 -0.0352 -0.2523 0.0806 -0.0731 -0.0886 0.0578 0.0719 0.1393 0.1527 0.1184 0.1509 0.1298 0.1315 0.1406 0.1422 0.1709 0.1450 0.1279 0.1458 0.1630
va: 1.2466 1.1986 1.2129 2.4125 3.3785 2.9267 2.8726 3.0315 3.8713 3.8302 3.9762 3.5067 3.9485 4.0290 3.6564 3.9453 3.9533 4.0499 3.9873 4.0343 3.8179 3.9862 3.9551 3.8724 4.0357 1.0155 0.9948 1.0307 0.9990 1.0137 1.0147 1.0045 1.0041 0.9946 1.0124 1.0184 1.0027 0.9937
dispcorr: -0.023816655 hartree
energy: -2653.564643486597
dipole: 3.78732 -3.54759 0.23974 20.23532 -20.25785 -0.02253 -6.03770 5.18423 -0.85347
magnitude: 0.88679 au
magnitude: 2.25403 debye
