program: Orca
programVersion: 4.2.1
elementType: Cl Cl Cl S N N N N C C C C C C C C C C C C C C C C C H H H H H H H H H H H H H
charge: 0
multiplicity: 1
keywords: wb97x-d3
keywords: def2-TZVPP
keywords: def2/J RIJCOSX GRIDX6 NOFINALGRIDX
keywords: grid4 nofinalgrid
keywords: scfconv7
keywords: smallprint printgap noloewdin
keywords: NOSOSCF
formula: C17H13Cl3N4S
InChI: InChI=1S/C17H13Cl3N4S/c18-13-3-1-12(2-4-13)9-25-17(8-24-11-21-10-22-24)23-16-6-5-14(19)7-15(16)20/h1-7,10-11H,8-9H2
38 atoms
Cl 1.477854 0.283184 3.425399
Cl -3.660689 -1.659616 -3.817203
Cl 3.793699 -3.575337 0.494954
S  -1.753302 2.770728 1.17957
N  1.843479 2.030582 -0.103626
N  -0.405484 0.5291 1.072806
N  1.485767 1.845471 -1.375175
N  3.56503 1.091898 -1.02216
C  0.931426 2.622163 0.833295
C  -3.050079 1.50352 1.260493
C  -0.317342 1.783106 1.01873
C  -3.201208 0.721011 -0.011296
C  -3.448173 1.3593 -1.222396
C  -3.107375 -0.665787 0.003016
C  0.63709 -0.373229 0.939711
C  -3.591158 0.636186 -2.395831
C  -3.255213 -1.406916 -1.159585
C  3.084523 1.575675 0.094916
C  1.547616 -0.639677 1.962747
C  0.721919 -1.143224 -0.220718
C  -3.49082 -0.745802 -2.353507
C  2.516758 -1.622294 1.839188
C  1.690221 -2.117156 -0.36963
C  2.582594 -2.350618 0.665131
C  2.546894 1.277554 -1.887185
H  0.67209 3.6259 0.494645
H  1.438254 2.730824 1.793066
H  -3.956736 2.069509 1.485144
H  -2.856344 0.850913 2.1110
H  -3.521997 2.439256 -1.264096
H  -2.905959 -1.182733 0.932254
H  -3.778727 1.147805 -3.330148
H  -3.175649 -2.485215 -1.130181
H  3.584183 1.624167 1.050138
H  0.012061 -0.960988 -1.016406
H  3.211124 -1.806485 2.647399
H  1.742771 -2.688934 -1.285877
H  2.594185 0.992211 -2.926537
elementType: Cl S N C H
totalener: -2653.54077810 hartree
nucrepener: 2792.69112268 hartree
electener: -5446.23190078 hartree
oneelecener: -9201.44024646 hartree
twoeener: 3755.20834568 hartree
cpcmener: -0.02545060 hartree
kineticenergy: 2647.22155807 hartree
xcener: -168.236729349672 hartree
chargesum: 0.0000000
charge: -0.081444 -0.103346 -0.093903 -0.073388 0.119715 -0.276424 -0.333817 -0.386615 -0.119449 -0.046861 0.178830 0.091596 -0.220186 -0.212692 0.228044 -0.129629 -0.137547 0.072701 -0.090357 -0.230664 0.080450 -0.078091 -0.121679 0.072085 0.058207 0.131929 0.150003 0.151762 0.117970 0.131179 0.129128 0.143929 0.142665 0.168816 0.140221 0.123598 0.143136 0.160128
qa: -0.0814 -0.1033 -0.0939 -0.0734 0.1197 -0.2764 -0.3338 -0.3866 -0.1194 -0.0469 0.1788 0.0916 -0.2202 -0.2127 0.2280 -0.1296 -0.1375 0.0727 -0.0904 -0.2307 0.0804 -0.0781 -0.1217 0.0721 0.0582 0.1319 0.1500 0.1518 0.1180 0.1312 0.1291 0.1439 0.1427 0.1688 0.1402 0.1236 0.1431 0.1601
va: 1.2457 1.2018 1.2093 2.3977 3.3332 3.0133 2.8525 3.0218 3.9236 3.8220 3.9363 3.5439 4.0213 3.9528 3.6562 3.9708 3.9327 4.0502 3.9495 3.9442 3.8342 3.9888 3.9968 3.8520 4.0542 1.0139 1.0001 0.9982 1.0319 1.0150 1.0132 1.0038 1.0045 0.9944 1.0116 1.0186 1.0039 0.9965
dispcorr: -0.025745736 hartree
energy: -2653.566523834925
dipole: -8.55325 7.65524 -0.89801 12.52693 -11.05761 1.46932 -0.77092 2.19005 1.41912
magnitude: 2.23142 au
magnitude: 5.67183 debye
