program: Orca
programVersion: 4.2.1
elementType: Cl Cl Cl S N N N N C C C C C C C C C C C C C C C C C H H H H H H H H H H H H H
charge: 0
multiplicity: 1
keywords: wb97x-d3
keywords: def2-TZVPP
keywords: def2/J RIJCOSX GRIDX6 NOFINALGRIDX
keywords: grid4 nofinalgrid
keywords: scfconv7
keywords: smallprint printgap noloewdin
keywords: NOSOSCF
formula: C17H13Cl3N4S
InChI: InChI=1S/C17H13Cl3N4S/c18-13-3-1-12(2-4-13)9-25-17(8-24-11-21-10-22-24)23-16-6-5-14(19)7-15(16)20/h1-7,10-11H,8-9H2
38 atoms
Cl 0.219286 -1.179199 1.721752
Cl -4.135878 -2.167063 1.96994
Cl 1.327267 -4.175858 -2.590392
S  -0.409582 2.659074 -1.578794
N  2.104904 3.218208 1.414385
N  1.134173 1.063944 0.093006
N  3.288694 3.63805 0.960521
N  3.529021 2.549854 2.903311
C  0.915418 3.374534 0.632609
C  -1.322716 1.196302 -2.140684
C  0.644229 2.169019 -0.248293
C  -2.005102 0.387198 -1.075736
C  -2.117724 -0.98757 -1.254635
C  -2.57238 0.959833 0.057001
C  1.119669 -0.134131 -0.589439
C  -2.776483 -1.779904 -0.328925
C  -3.233536 0.181792 0.994068
C  2.264597 2.556633 2.562238
C  0.772244 -1.300867 0.096322
C  1.56207 -0.258244 -1.905517
C  -3.327159 -1.185215 0.793719
C  0.827988 -2.542575 -0.508752
C  1.633759 -1.493768 -2.526243
C  1.258636 -2.626699 -1.823096
C  4.109846 3.222295 1.888622
H  1.01034 4.285334 0.04125
H  0.061099 3.515875 1.296703
H  -0.685177 0.568267 -2.760373
H  -2.06485 1.638847 -2.811523
H  -1.682117 -1.456352 -2.128807
H  -2.506292 2.02787 0.222457
H  -2.846795 -2.84839 -0.480896
H  -3.664853 0.642341 1.872496
H  1.444788 2.113308 3.104755
H  1.874138 0.625808 -2.447254
H  0.531654 -3.427991 0.036464
H  1.981471 -1.564005 -3.547564
H  5.170072 3.41555 1.837143
elementType: Cl S N C H
totalener: -2653.53861441 hartree
nucrepener: 2814.15270411 hartree
electener: -5467.69131851 hartree
oneelecener: -9243.56798944 hartree
twoeener: 3775.87667093 hartree
cpcmener: -0.02913709 hartree
kineticenergy: 2647.23131816 hartree
xcener: -168.240036043051 hartree
chargesum: 0.0000000
charge: -0.074112 -0.100910 -0.090659 -0.083594 0.099617 -0.274420 -0.354382 -0.411744 -0.035967 -0.055960 0.125341 0.037367 -0.204733 -0.175258 0.148638 -0.149287 -0.153414 0.081655 0.048734 -0.272983 0.103383 -0.112563 -0.103085 0.060225 0.066292 0.132186 0.140027 0.134534 0.159654 0.145088 0.133797 0.136819 0.141399 0.162511 0.166535 0.121404 0.146637 0.161229
qa: -0.0741 -0.1009 -0.0907 -0.0836 0.0996 -0.2744 -0.3544 -0.4117 -0.0360 -0.0560 0.1253 0.0374 -0.2047 -0.1753 0.1486 -0.1493 -0.1534 0.0817 0.0487 -0.2730 0.1034 -0.1126 -0.1031 0.0602 0.0663 0.1322 0.1400 0.1345 0.1597 0.1451 0.1338 0.1368 0.1414 0.1625 0.1665 0.1214 0.1466 0.1612
va: 1.2498 1.2033 1.2125 2.3925 3.3732 2.9915 2.8670 3.0250 3.8324 3.8765 4.0162 3.5826 3.9427 3.9639 3.7097 3.9926 4.0238 4.0726 3.9184 4.0365 3.8018 3.9652 3.9794 3.8335 4.0539 1.0128 0.9972 1.0089 0.9915 0.9924 1.0181 1.0091 1.0058 1.0030 0.9985 1.0242 1.0037 0.9946
dispcorr: -0.026572437 hartree
energy: -2653.565186842962
dipole: 2.10129 -3.82455 -1.72327 19.10870 -18.12585 0.98285 -6.67823 4.83119 -1.84704
magnitude: 2.71057 au
magnitude: 6.88972 debye
