program: Orca
programVersion: 4.2.1
elementType: Cl Cl Cl S N N N N C C C C C C C C C C C C C C C C C H H H H H H H H H H H H H
charge: 0
multiplicity: 1
keywords: wb97x-d3
keywords: def2-TZVPP
keywords: def2/J RIJCOSX GRIDX6 NOFINALGRIDX
keywords: grid4 nofinalgrid
keywords: scfconv7
keywords: smallprint printgap noloewdin
keywords: NOSOSCF
formula: C17H13Cl3N4S
InChI: InChI=1S/C17H13Cl3N4S/c18-13-3-1-12(2-4-13)9-25-17(8-24-11-21-10-22-24)23-16-6-5-14(19)7-15(16)20/h1-7,10-11H,8-9H2
38 atoms
Cl -0.139632 -0.9539 0.894807
Cl -4.25092 -1.80595 2.298047
Cl 4.03545 -3.703067 -1.07926
S  -0.848291 3.142178 -1.296813
N  1.756188 1.994374 0.839302
N  0.153607 0.723992 -1.51315
N  0.873019 2.410601 1.74712
N  2.377523 1.039931 2.680624
C  1.664457 2.423439 -0.533058
C  -2.287777 2.156265 -1.778559
C  0.3786 1.913052 -1.154645
C  -2.737754 1.170313 -0.737617
C  -3.106925 -0.112938 -1.123166
C  -2.834705 1.514798 0.605774
C  1.110624 -0.277502 -1.389345
C  -3.579798 -1.032515 -0.200696
C  -3.298918 0.606519 1.543675
C  2.645743 1.173633 1.405933
C  1.05611 -1.178461 -0.323768
C  2.094511 -0.465964 -2.356745
C  -3.670436 -0.662433 1.130124
C  1.950287 -2.230458 -0.219753
C  2.997398 -1.51259 -2.269819
C  2.916914 -2.38769 -1.199602
C  1.283248 1.81248 2.834846
H  2.527862 2.033709 -1.070527
H  1.722126 3.511319 -0.576002
H  -2.080343 1.661219 -2.726847
H  -3.06465 2.900745 -1.970504
H  -3.022738 -0.409628 -2.16132
H  -2.532864 2.499145 0.940461
H  -3.86085 -2.027331 -0.519129
H  -3.366564 0.889516 2.585533
H  3.456961 0.716816 0.860593
H  2.144371 0.212742 -3.198564
H  1.892481 -2.912009 0.617705
H  3.751005 -1.639124 -3.03478
H  0.777237 1.939473 3.779168
elementType: Cl S N C H
totalener: -2653.54020435 hartree
nucrepener: 2846.12598956 hartree
electener: -5499.66619391 hartree
oneelecener: -9308.75163225 hartree
twoeener: 3809.08543834 hartree
cpcmener: -0.02831634 hartree
kineticenergy: 2647.23674047 hartree
xcener: -168.238904367766 hartree
chargesum: 0.0000000
charge: -0.077290 -0.107142 -0.091757 -0.063550 0.116888 -0.287060 -0.328593 -0.398337 -0.054448 -0.044400 0.156005 0.106761 -0.224630 -0.202973 0.159154 -0.124374 -0.129582 0.046247 -0.019328 -0.270002 0.068650 -0.073588 -0.084570 0.041305 0.065122 0.142228 0.132200 0.112646 0.147555 0.129850 0.116660 0.139870 0.139861 0.173858 0.156050 0.127002 0.145552 0.158161
qa: -0.0773 -0.1071 -0.0918 -0.0635 0.1169 -0.2871 -0.3286 -0.3983 -0.0544 -0.0444 0.1560 0.1068 -0.2246 -0.2030 0.1592 -0.1244 -0.1296 0.0462 -0.0193 -0.2700 0.0687 -0.0736 -0.0846 0.0413 0.0651 0.1422 0.1322 0.1126 0.1476 0.1298 0.1167 0.1399 0.1399 0.1739 0.1561 0.1270 0.1456 0.1582
va: 1.2531 1.1961 1.2106 2.4025 3.3405 3.0014 2.8666 3.0133 3.9278 3.8407 3.9318 3.5298 3.9970 3.9956 3.7524 3.9498 3.9471 4.0745 3.9639 4.0182 3.8029 3.9849 3.9434 3.8804 4.0443 1.0025 1.0090 1.0334 0.9976 1.0065 1.0301 1.0044 1.0051 0.9909 0.9998 1.0192 1.0022 0.9960
dispcorr: -0.026626893 hartree
energy: -2653.566831240658
dipole: -0.82113 1.49563 0.67450 17.36652 -15.78769 1.57882 -9.05388 6.52460 -2.52928
magnitude: 3.05694 au
magnitude: 7.77013 debye
