program: Orca
programVersion: 4.2.1
elementType: Cl Cl Cl S N N N N C C C C C C C C C C C C C C C C C H H H H H H H H H H H H H
charge: 0
multiplicity: 1
keywords: wb97x-d3
keywords: def2-TZVPP
keywords: def2/J RIJCOSX GRIDX6 NOFINALGRIDX
keywords: grid4 nofinalgrid
keywords: scfconv7
keywords: smallprint printgap noloewdin
keywords: NOSOSCF
formula: C17H13Cl3N4S
InChI: InChI=1S/C17H13Cl3N4S/c18-13-3-1-12(2-4-13)9-25-17(8-24-11-21-10-22-24)23-16-6-5-14(19)7-15(16)20/h1-7,10-11H,8-9H2
38 atoms
Cl -0.473611 -1.282063 1.234974
Cl -4.922326 -2.254953 0.632819
Cl 3.114206 -4.665108 -0.888002
S  -0.393628 2.953427 -0.116234
N  2.306911 2.730671 1.156022
N  0.442419 0.59659 -0.917397
N  3.128269 3.073853 0.162073
N  3.120941 4.644078 1.757811
C  1.571041 1.496003 1.094954
C  -1.690242 2.437659 -1.281926
C  0.598437 1.50995 -0.06299
C  -2.497624 1.270017 -0.798426
C  -3.207125 1.334739 0.396661
C  -2.555155 0.098311 -1.543617
C  1.1064 -0.620371 -0.857837
C  -3.955606 0.257686 0.842707
C  -3.303695 -0.987533 -1.11653
C  2.31051 3.67457 2.101653
C  0.752186 -1.609641 0.062856
C  2.093736 -0.922739 -1.793888
C  -3.994933 -0.89858 0.079097
C  1.360588 -2.854867 0.057755
C  2.720978 -2.155032 -1.805858
C  2.345907 -3.114893 -0.878643
C  3.594304 4.226159 0.566676
H  1.025117 1.374662 2.030866
H  2.272394 0.666749 1.004362
H  -1.239488 2.239947 -2.253437
H  -2.309951 3.330649 -1.388607
H  -3.176965 2.23449 0.999464
H  -2.0047 0.02367 -2.472273
H  -4.502155 0.322894 1.77385
H  -3.335174 -1.892548 -1.708098
H  1.717691 3.60905 3.000642
H  2.36968 -0.172672 -2.523384
H  1.069124 -3.605124 0.779802
H  3.491266 -2.36135 -2.536085
H  4.305037 4.78904 -0.018197
elementType: Cl S N C H
totalener: -2653.54325943 hartree
nucrepener: 2747.77205267 hartree
electener: -5401.31531211 hartree
oneelecener: -9111.24882535 hartree
twoeener: 3709.93351324 hartree
cpcmener: -0.02700544 hartree
kineticenergy: 2647.22912581 hartree
xcener: -168.234225198504 hartree
chargesum: -0.0000000
charge: -0.081061 -0.105156 -0.091077 -0.088525 0.072756 -0.260826 -0.341496 -0.408226 -0.065600 -0.041211 0.142605 0.091950 -0.235552 -0.204466 0.166340 -0.125145 -0.133554 0.088782 -0.029470 -0.243358 0.078825 -0.080038 -0.091820 0.059273 0.072919 0.131980 0.147161 0.118376 0.151880 0.131894 0.129562 0.142451 0.141020 0.179846 0.143181 0.127706 0.145565 0.162511
qa: -0.0811 -0.1052 -0.0911 -0.0885 0.0728 -0.2608 -0.3415 -0.4082 -0.0656 -0.0412 0.1426 0.0920 -0.2356 -0.2045 0.1663 -0.1251 -0.1336 0.0888 -0.0295 -0.2434 0.0788 -0.0800 -0.0918 0.0593 0.0729 0.1320 0.1472 0.1184 0.1519 0.1319 0.1296 0.1425 0.1410 0.1798 0.1432 0.1277 0.1456 0.1625
va: 1.2456 1.1991 1.2121 2.3930 3.3896 2.9542 2.8607 3.0268 3.8906 3.8321 3.9540 3.5027 4.0320 3.9506 3.6693 3.9535 3.9438 4.0335 3.9900 4.0468 3.8233 3.9918 3.9582 3.8677 4.0459 1.0082 0.9995 1.0311 0.9985 1.0146 1.0146 1.0042 1.0044 0.9896 1.0135 1.0182 1.0028 0.9944
dispcorr: -0.023619929 hartree
energy: -2653.566879363554
dipole: 2.84142 -3.12886 -0.28744 20.75248 -20.44760 0.30487 -4.37855 4.32014 -0.05841
magnitude: 0.42306 au
magnitude: 1.07534 debye
