program: Orca
programVersion: 4.2.1
elementType: Cl Cl Cl S N N N N C C C C C C C C C C C C C C C C C H H H H H H H H H H H H H
charge: 0
multiplicity: 1
keywords: wb97x-d3
keywords: def2-TZVPP
keywords: def2/J RIJCOSX GRIDX6 NOFINALGRIDX
keywords: grid4 nofinalgrid
keywords: scfconv7
keywords: smallprint printgap noloewdin
keywords: NOSOSCF
formula: C17H13Cl3N4S
InChI: InChI=1S/C17H13Cl3N4S/c18-13-3-1-12(2-4-13)9-25-17(8-24-11-21-10-22-24)23-16-6-5-14(19)7-15(16)20/h1-7,10-11H,8-9H2
38 atoms
Cl 1.155212 -1.542129 2.886716
Cl -4.845273 -1.413924 -2.646277
Cl 2.817563 -4.822256 -1.027975
S  -0.455873 2.718752 0.824605
N  2.324497 3.050293 0.034272
N  0.266545 0.203031 0.70588
N  2.877068 3.15362 1.245141
N  2.894907 5.13299 0.198065
C  1.794896 1.795471 -0.426043
C  -1.898733 1.825575 1.472406
C  0.581547 1.379081 0.377304
C  -2.627504 1.020678 0.438294
C  -3.194403 1.632818 -0.67587
C  -2.759562 -0.355906 0.582093
C  0.930893 -0.92977 0.273325
C  -3.876886 0.892837 -1.628283
C  -3.443845 -1.111915 -0.357667
C  2.337882 4.238504 -0.578655
C  1.358793 -1.876531 1.207942
C  1.087334 -1.235995 -1.078819
C  -3.99527 -0.478532 -1.459212
C  1.947301 -3.066941 0.819147
C  1.663904 -2.425464 -1.488297
C  2.094601 -3.331393 -0.533383
C  3.205005 4.417591 1.299282
H  2.572124 1.033683 -0.368747
H  1.517556 1.912756 -1.474068
H  -2.534346 2.616552 1.875732
H  -1.578765 1.206074 2.309052
H  -3.10044 2.703503 -0.813524
H  -2.316247 -0.852715 1.435377
H  -4.311651 1.381263 -2.490106
H  -3.536774 -2.18235 -0.231595
H  1.940179 4.394284 -1.569607
H  0.722246 -0.541809 -1.825054
H  2.281198 -3.778441 1.561841
H  1.767295 -2.639667 -2.543011
H  3.688902 4.843867 2.164353
elementType: Cl S N C H
totalener: -2653.54406192 hartree
nucrepener: 2683.57411423 hartree
electener: -5337.11817616 hartree
oneelecener: -8982.54121923 hartree
twoeener: 3645.42304307 hartree
cpcmener: -0.02983774 hartree
kineticenergy: 2647.22096613 hartree
xcener: -168.232612997123 hartree
chargesum: -0.0000000
charge: -0.074887 -0.102735 -0.090183 -0.088976 0.061599 -0.285063 -0.333329 -0.405911 -0.083852 -0.035881 0.188880 0.059398 -0.227037 -0.178430 0.201907 -0.133107 -0.138846 0.085196 -0.087463 -0.253649 0.078656 -0.060557 -0.086400 0.052223 0.069454 0.148789 0.143682 0.151816 0.119352 0.133887 0.122960 0.143730 0.142842 0.180024 0.149150 0.124206 0.146055 0.162502
qa: -0.0749 -0.1027 -0.0902 -0.0890 0.0616 -0.2851 -0.3333 -0.4059 -0.0839 -0.0359 0.1889 0.0594 -0.2270 -0.1784 0.2019 -0.1331 -0.1388 0.0852 -0.0875 -0.2536 0.0787 -0.0606 -0.0864 0.0522 0.0695 0.1488 0.1437 0.1518 0.1194 0.1339 0.1230 0.1437 0.1428 0.1800 0.1491 0.1242 0.1461 0.1625
va: 1.2503 1.2029 1.2133 2.4010 3.3963 2.9111 2.8603 3.0266 3.8919 3.8240 3.9130 3.5444 4.0204 3.9432 3.5953 3.9659 3.9602 4.0359 4.0081 4.0293 3.8404 3.9626 3.9573 3.8786 4.0485 0.9951 0.9903 0.9989 1.0344 1.0131 1.0214 1.0043 1.0043 0.9895 1.0031 1.0214 1.0032 0.9945
dispcorr: -0.021605149 hartree
energy: -2653.565667074187
dipole: -1.69986 1.32687 -0.37299 19.66132 -19.37590 0.28542 -0.92170 -0.14087 -1.06257
magnitude: 1.16174 au
magnitude: 2.95291 debye
