program: Orca
programVersion: 4.2.1
elementType: Cl Cl Cl S N N N N C C C C C C C C C C C C C C C C C H H H H H H H H H H H H H
charge: 0
multiplicity: 1
keywords: wb97x-d3
keywords: def2-TZVPP
keywords: def2/J RIJCOSX GRIDX6 NOFINALGRIDX
keywords: grid4 nofinalgrid
keywords: scfconv7
keywords: smallprint printgap noloewdin
keywords: NOSOSCF
formula: C17H13Cl3N4S
InChI: InChI=1S/C17H13Cl3N4S/c18-13-3-1-12(2-4-13)9-25-17(8-24-11-21-10-22-24)23-16-6-5-14(19)7-15(16)20/h1-7,10-11H,8-9H2
38 atoms
Cl 1.417402 0.426713 3.165705
Cl -4.140314 -2.455096 -3.002667
Cl 3.489004 -3.644099 0.336625
S  -1.598964 3.072183 0.26112
N  2.190272 2.094222 -0.311549
N  -0.278827 0.869864 0.786354
N  2.89498 1.276003 -1.100938
N  4.033289 1.732525 0.775952
C  0.877645 2.534557 -0.68445
C  -2.888632 1.951022 0.885438
C  -0.232681 1.97278 0.185863
C  -3.213227 0.849538 -0.079214
C  -2.972754 -0.478235 0.252346
C  -3.751952 1.13671 -1.329868
C  0.653882 -0.151612 0.65104
C  -3.258616 -1.500887 -0.639312
C  -4.043617 0.127552 -2.231244
C  2.887076 2.35661 0.80649
C  1.482324 -0.502036 1.714981
C  0.696579 -0.93277 -0.500574
C  -3.79078 -1.190266 -1.879391
C  2.365423 -1.563209 1.621413
C  1.556423 -2.010442 -0.602031
C  2.393987 -2.314068 0.458217
C  3.988857 1.083671 -0.408758
H  0.713452 2.230885 -1.718708
H  0.832797 3.626429 -0.664726
H  -3.748841 2.601626 1.054692
H  -2.569777 1.5608 1.85068
H  -2.54446 -0.722242 1.215357
H  -3.938055 2.165646 -1.613809
H  -3.060425 -2.52935 -0.371356
H  -4.462726 0.361173 -3.200212
H  2.519959 2.989162 1.600042
H  0.033702 -0.693607 -1.321798
H  3.019899 -1.797506 2.44862
H  1.578946 -2.603944 -1.504908
H  4.786381 0.454028 -0.769733
totalener: -2653.50872626 hartree
nucrepener: 2788.28234711 hartree
electener: -5441.79107337 hartree
oneelecener: -9192.25606688 hartree
twoeener: 3750.46499351 hartree
kineticenergy: 2647.23379942 hartree
xcener: -168.236562306050 hartree
chargesum: -0.0000000
charge: -0.073812 -0.076312 -0.077615 -0.064806 0.118560 -0.278817 -0.297183 -0.314245 -0.108443 -0.079467 0.146977 0.045489 -0.170197 -0.195252 0.208183 -0.126749 -0.109730 0.010845 -0.085753 -0.201577 0.076043 -0.038751 -0.067196 0.036456 0.065553 0.138907 0.131165 0.141556 0.122646 0.124164 0.114876 0.126692 0.123837 0.151660 0.114827 0.112021 0.120726 0.134721
qa: -0.0738 -0.0763 -0.0776 -0.0648 0.1186 -0.2788 -0.2972 -0.3142 -0.1084 -0.0795 0.1470 0.0455 -0.1702 -0.1953 0.2082 -0.1267 -0.1097 0.0108 -0.0858 -0.2016 0.0760 -0.0388 -0.0672 0.0365 0.0656 0.1389 0.1312 0.1416 0.1226 0.1242 0.1149 0.1267 0.1238 0.1517 0.1148 0.1120 0.1207 0.1347
va: 1.2496 1.2308 1.2248 2.3904 3.3017 2.9290 2.8360 3.0375 3.8925 3.8416 3.9685 3.5891 3.9467 4.0403 3.6796 3.9679 3.9917 4.0774 3.9380 4.0308 3.9278 3.9574 3.9913 3.9232 4.0296 1.0074 1.0022 0.9990 1.0361 1.0170 1.0177 1.0111 1.0111 1.0065 1.0130 1.0228 1.0107 1.0019
dispcorr: -0.026033654 hartree
energy: -2653.534759916963
dipole: -7.46343 6.24078 -1.22265 14.62524 -13.43588 1.18936 -3.56330 3.34334 -0.21996
magnitude: 1.71983 au
magnitude: 4.37147 debye
