program: Orca
programVersion: 4.2.1
elementType: Cl Cl Cl S N N N N C C C C C C C C C C C C C C C C C H H H H H H H H H H H H H
charge: 0
multiplicity: 1
keywords: wb97x-d3
keywords: def2-TZVPP
keywords: def2/J RIJCOSX GRIDX6 NOFINALGRIDX
keywords: grid4 nofinalgrid
keywords: scfconv7
keywords: smallprint printgap noloewdin
keywords: NOSOSCF
formula: C17H13Cl3N4S
InChI: InChI=1S/C17H13Cl3N4S/c18-13-3-1-12(2-4-13)9-25-17(8-24-11-21-10-22-24)23-16-6-5-14(19)7-15(16)20/h1-7,10-11H,8-9H2
38 atoms
Cl -0.160594 -2.543476 0.305702
Cl -5.915822 -0.379462 1.56663
Cl 3.85302 -4.259059 -2.81426
S  0.446649 0.906083 -1.098773
N  0.931587 2.918988 1.516533
N  1.667293 -0.264052 0.943062
N  0.161184 3.978508 1.248531
N  2.308111 4.596447 1.414782
C  0.38626 1.592386 1.668726
C  -1.044251 1.951401 -1.066223
C  0.876252 0.657039 0.591194
C  -2.241478 1.339437 -0.397589
C  -2.999234 2.105331 0.48226
C  -2.635761 0.029915 -0.653698
C  2.155745 -1.185824 0.017858
C  -4.132298 1.58502 1.089936
C  -3.764338 -0.501356 -0.054696
C  2.210967 3.307449 1.612816
C  1.420011 -2.314576 -0.342928
C  3.429392 -1.033587 -0.520291
C  -4.509723 0.282085 0.814184
C  1.937589 -3.262735 -1.208542
C  3.958113 -1.967708 -1.392744
C  3.206005 -3.079963 -1.732749
C  1.029094 4.960403 1.194855
H  -0.698417 1.675935 1.671143
H  0.695579 1.169006 2.62394
H  -1.239535 2.10741 -2.130142
H  -0.81511 2.927994 -0.642876
H  -2.693235 3.120032 0.708695
H  -2.046295 -0.592698 -1.314288
H  -4.711844 2.188469 1.774553
H  -4.062532 -1.520248 -0.259175
H  3.018684 2.624453 1.827865
H  4.013648 -0.167571 -0.239377
H  1.351967 -4.131704 -1.47259
H  4.948585 -1.830825 -1.802787
H  0.727056 5.975967 0.99362
totalener: -2653.51237093 hartree
nucrepener: 2698.37847095 hartree
electener: -5351.89084189 hartree
oneelecener: -9011.82462740 hartree
twoeener: 3659.93378552 hartree
kineticenergy: 2647.22831596 hartree
xcener: -168.232088394375 hartree
chargesum: -0.0000000
charge: -0.069289 -0.074693 -0.072984 -0.034775 0.107945 -0.236858 -0.347278 -0.328927 -0.102476 -0.082533 0.061272 0.001670 -0.198965 -0.198842 0.159790 -0.109026 -0.093426 0.054636 -0.006047 -0.175509 0.070257 -0.103479 -0.097020 0.060686 0.087567 0.163755 0.136807 0.140347 0.132890 0.137821 0.120310 0.126113 0.126201 0.152215 0.116645 0.115446 0.124275 0.135478
qa: -0.0693 -0.0747 -0.0730 -0.0348 0.1079 -0.2369 -0.3473 -0.3289 -0.1025 -0.0825 0.0613 0.0017 -0.1990 -0.1988 0.1598 -0.1090 -0.0934 0.0546 -0.0060 -0.1755 0.0703 -0.1035 -0.0970 0.0607 0.0876 0.1638 0.1368 0.1403 0.1329 0.1378 0.1203 0.1261 0.1262 0.1522 0.1166 0.1154 0.1243 0.1355
va: 1.2536 1.2319 1.2302 2.3955 3.2911 2.9888 2.8231 3.0662 3.8041 3.8541 3.9905 3.6382 3.9516 4.0151 3.8481 4.0079 3.9867 4.0691 4.0136 4.0374 3.9495 4.0346 3.9997 3.9317 4.0205 0.9977 1.0237 0.9941 1.0407 1.0266 1.0295 1.0109 1.0108 1.0025 1.0149 1.0216 1.0103 0.9992
dispcorr: -0.022894325 hartree
energy: -2653.535265258550
dipole: 1.65379 -1.82783 -0.17403 22.40385 -22.03180 0.37205 2.83409 -3.01966 -0.18557
magnitude: 0.45071 au
magnitude: 1.14562 debye
